SCH Number,Lead Agency Name,Lead Agency Title,Lead Agency Acronym,Document Title,Document Type,Received,Posted,Document Description,Document Portal URL,Project Title,Contact Full Name,Contact Authority,Contact Job Title,Contact Email Address,Contact Address  1,Contact Address  2,Contact City,Contact State,Contact Zip Code,Contact Phone Number,Location Coordinates,Cities,Counties,County Clerks,Location Cross Streets,Location Zip Code,Location Total Acres,Location Parcel Number,Location State Highways,Location Waterways,Location Airports,NOC Has Non Late Comment,NOC State Review Start Date,NOC State Review End Date,NOC Development Type,NOC Local Action,NOC Project Issues,NOC Local Review Start Date,NOC Local Review End Date,NOE Exempt Status,NOE Exempt Citation,NOE Reasons for Exemption,NOD Agency,NOD Approved By Lead Agency,NOD Approved Date,NOD Significant Environmental Impact,NOD Environmental Impact Report Prepared,NOD Negative Declaration Prepared,NOD Other Document Type,NOD Mitigation Measures,NOD Mitigation Reporting Or Monitoring Plan,NOD Statement Of Overriding Considerations Adopted,NOD Findings Made Pursuant,NOD Final EIR Available Location
2008012065,"Martinez, City of",City of Martinez,,Martinez Marina Waterside Improvements,NOD,8/14/2012,8/14/2012,"This proposed project involves hydraulic dredging a small portion of the Martinez Marina to depths ranging from approximately -6 feet to -8 mean lower low water (MLLW), with an additional 2 feet over dredge allowance. The estimated maximum volume of dredge material is 24,100 cubic yards over a surface area of approximately 2.84 acres. Sediment would be removed with a cutterhead hydraulic suction dredge and conveyed via an 8- to 12-inch diameter pipe to the City of Martinez upland disposal ponds located southeast of the marina. The Project would result in permanent impacts to 0.08 acres of delta smelt (Hypomesus transpacifficus) habitat. The project is expected to result in incidental take of delta smelt and longfin smelt (Spirinchus thaleichthys), which are designated as an endangered and threatened species, respectively, under the California Endangered Species Act.  The ITP referenced above as issued by DFG authorizes incidental take of species listed under CESA that may occur as a result of Project implementation.",https://ceqanet.opr.ca.gov/2008012065/3,Martinez Marina Waterside Improvements,Crystal Spurr,Department of Fish and Game,N/A,,Bay Delta Region,7329 Silverado Trail,Napa,CA,94558,2099483777,,Martinez,Contra Costa,,,94553,70,373-040-003,,Southern shore of Suisun Bay where it joins with the Carquinez Strait,,,,,,,,,,,,,DFG                                                             ,No,8/2/2012,No,No,Yes,,Yes,,No,No,"City of Martinez, 525 Henrietta Street, Martinez, CA 94553"
2011082039,"Morgan Hill, City of",City of Morgan Hill,,Cochrane-Borello Residential Development Project,EIR,8/14/2012,,"The proposed project includes removal of the existing orchards and associated uses, and development of a gated residential community consisting of 244 single-family homes, up to 180 secondary units, a private recreation center (including community pool, tennis court, basketball court, tot lot, fitness center and outdoor gathering areas), private streets, ~23 acres of private open space, private parks, and surrounding landscaping.  The proposed lots would range in size from ~ 10,000 sf to over 30,000 sf, averaging approximately 15,000 sf.  The proposed single family homes would be one and two-stories and range in size from 3,000 sf to 6,000 sf.",https://ceqanet.opr.ca.gov/2011082039/2,Cochrane-Borello Residential Development Project,Terry Linder,City of Morgan Hill,N/A,,17575 Peak Avenue,,Morgan Hill,CA,95037,4087786480,37�09'39.34"N 121�38'02.50"W,Morgan Hill,Santa Clara,,Cochrane Road and Peet Road,95037,124,"728-34-027, 728-33-005, 728-33-004",US Hwy 101,"Coyote Creek, Anderson Reservoir",,Yes,8/14/2012,9/27/2012,Residential,"Land Division (Subdivision, etc.), Rezone, Site Plan","Aesthetics, Agriculture and Forestry Resources, Air Quality, Biological Resources, Cultural Resources, Cumulative Effects, Drainage/Absorption, Flood Plain/Flooding, Geology/Soils, Hazards & Hazardous Materials, Hydrology/Water Quality, Land Use/Planning, Mineral Resources, Noise, Population/Housing, Public Services, Recreation, Schools/Universities, Sewer Capacity, Solid Waste, Transportation, Vegetation, Wildfire",,,,,,,,,,,,,,,,,
2012058152,"Parks and Recreation, Department of",California Department of Parks and Recreation,,Ehrman Mansion American's with Disabilities Ramp,NOE,8/14/2012,8/14/2012,"Install a removable American's with Disabilities (ADA) ramp at the back door of the Ehrman Mansion at Sugar Point State Park for access. Work will construct a non-skid surface platform out of pressure treated wood and five planks from standard decking overthe rock entry way and install a pre-fabricated landing area, a 28' ramp off the landing and a set of steps over thr rock steps and paved area. The ramp will be coated with a brown color to match the building as best as possible.",https://ceqanet.opr.ca.gov/2012058152,Ehrman Mansion American's with Disabilities Ramp,Diane Cassano,California Department of Parks and Recreation,N/A,,Sierra District Headquarters,P.O. Box 266,Tahoma,CA,96142,5305253342,,,El Dorado,,,,,,,,,,,,,,,,,Categorical Exemption,S:15301,Existing Facilities.,,,,,,,,,,,,
2012072002,Fish & Game #2,,,Independence Creek Cutbank Restoration,NOD,8/14/2012,8/14/2012,"The purpose of the project is to remove a non-functioning fish weir and restore an eroded stream bank. The weir was installed to trap Lahontan cutthroat trout (Oncorhynchus clarkii henshaw) to establish a broodstock source in another reservoir during the 1970's. The weir subsequently failed in a flood event and needs to be removed. The constriction in the stream channel caused by the fish weir led to an increase of force on the downstream bank, causing severe erosion. We intend to remove the fish weir remnant structure, and restore and stabilize the stream.",https://ceqanet.opr.ca.gov/2012072002/2,Independence Creek Cutbank Restoration,Katherine Hill,California Department of Fish and Game,N/A,,North Central Region,1701 Nimbus Road,Rancho Cordova,CA,95670,9163582382,39�25'"N 120�19'"W,Truckee,Nevada,,,,.9,16-010-06,Route 89,Independence Creek,No,,,,,,,,,,,,CA Department of Fish and Game                                  ,Yes,8/14/2012,No,No,Yes,,Yes,,No,Yes,"CA Department of Fish and Game, 1701 Nimbus Road, Rancho Cordova, CA 95670"
2012081037,"Vista, City of",City of Vista,,North Melrose Apartments,NEG,8/14/2012,,"The proposed project consists of a request for approval of General Plan Amendment, Specific Plan Amendment, Zoning Code Change, Site Development Plan, and Tentative Parcel Map for development and construction of a new 407-unit residential-apartment community on a vacant 20.6-acre parcel.  The apartment community would be comprised of 11 separate buildings each containing 37 apartment homes.",https://ceqanet.opr.ca.gov/2012081037,North Melrose Apartments,John Hamilton,City of Vista,N/A,,200 Civic Center Dr.,,Vista,CA,92084,(760) 726-1340 x1215,33�13'4.70"N 117�15'33.59"W,Vista,San Diego,,North Melrose Dr./North Avenue,,20.6,"161-061-37, 38, 39",SR 78,"Loma Alta Crk, Buena Vista Crk",,Yes,8/14/2012,9/12/2012,"Industrial, Residential","General Plan Amendment, Land Division (Subdivision, etc.), Rezone, Site Plan, Specific Plan","Aesthetics, Agriculture and Forestry Resources, Air Quality, Biological Resources, Cultural Resources, Drainage/Absorption, Flood Plain/Flooding, Geology/Soils, Hazards & Hazardous Materials, Hydrology/Water Quality, Land Use/Planning, Mineral Resources, Noise, Population/Housing, Public Services, Recreation, Sewer Capacity, Solid Waste, Transportation, Vegetation, Wetland/Riparian, Wildfire",,,,,,,,,,,,,,,,,
2012082047,"Fremont, City of",City of Fremont,,Delta Products Corp.,MND,8/14/2012,,"The proposed project is a preliminary grading plan to cut/pill approximately 40,603 cubic yards of soil in conjunction with site plan and architectural review for an approximately 178,000 sf office/ warehouse building with two + three stories.",https://ceqanet.opr.ca.gov/2012082047,Delta Products Corp.,Terry Wong,City of Fremont,N/A,,39550 Liberty Street,,Fremont,CA,94538,5104944456,,Fremont,Alameda,,Southwest Quardrant of Fremont Blvd + Cushing Parkway,94538,15.5,519-850-122,I-880,,,No,8/14/2012,9/12/2012,Industrial,Site Plan,"Aesthetics, Agriculture and Forestry Resources, Air Quality, Biological Resources, Cultural Resources, Geology/Soils, Hydrology/Water Quality, Land Use/Planning, Mineral Resources, Noise, Population/Housing, Public Services, Recreation, Transportation, Vegetation, Wetland/Riparian, Wildlife",,,,,,,,,,,,,,,,,
2012082048,"Pacifica, City of",City of Pacifica,,Housing Element Update,NEG,8/14/2012,,The project is an update of the City of Pacifica General Plan Housing Element for the planning period of 2007-2014 as required by the CA Government Code.,https://ceqanet.opr.ca.gov/2012082048,Housing Element Update,Lee Diaz,City of Pacifica,N/A,,1800 Francisco Boulevard,,Pacifica,CA,94044,6507387442,,Pacifica,San Mateo,,City-wide,,94044,,,,,No,8/14/2012,9/12/2012,,"General Plan Element, General Plan Update",,,,,,,,,,,,,,,,,,
2012082049,San Joaquin County,,,PA-1200118-Use Permit Application for a Religious Assembly with a Maximum of 50 Members,NEG,8/14/2012,,"A Use Permit application for a religious assembly with a maximum of 50 members.  Phase One, with building permits to be issued within 18 months, is the conversion of an existing 1,440 sf warehouse into a 4,890 sf assembly hall and sitting meditation building and a 1,500 sf restroom building.  Phase Two, with building permits to be issued within 10 years, is the construction of a 9 meditation cabins, totaling 4,056 sf, for use by congregation members, and a 16,900 sf temple with an overall height of 80 feet.  The existing house on site will be used by a religious elder.  This parcel is not under a Williamson Act contract.",https://ceqanet.opr.ca.gov/2012082049,PA-1200118-Use Permit Application for a Religious Assembly with a Maximum of 50 Members,Corinne King,San Joaquin County,N/A,,1810 East Hazelton Avenue,,Stockton,CA,95204,2099537509,,"Lathrop, Manteca, Stockton",San Joaquin,,Wyman Road,95231,5,193-220-15,,,Stockton Metropolitan,Yes,8/14/2012,9/12/2012,Commercial,Use Permit,"Agriculture and Forestry Resources, Land Use/Planning, Noise, Septic System, Transportation",,,,,,,,,,,,,,,,,
2012082050,San Joaquin County,,,PA-1200147-Site Approval Application to Expand an Existing Walnut Processing Facility in Two Phases,NEG,8/14/2012,,"A Site Approval application to expand an existing walnut processing facility in two phases over ten years.  Phase One, with building permits to be issued within eighteen months, is the construction of a 24,000 sf walnut storage building.  Phase Two, with building permits to be issued within 10 years, is the construction of a 24,000 sf walnut storage building.  This parcel is under a Williamson Act contract.  The project is located on the east side of Pezzi Road, 1,500 feet south of Eight Mile Road, east of Stockton.",https://ceqanet.opr.ca.gov/2012082050,PA-1200147-Site Approval Application to Expand an Existing Walnut Processing Facility in Two Phases,Corinne King,San Joaquin County,N/A,,1810 East Hazelton Avenue,,Stockton,CA,95204,2099537509,,,San Joaquin,,Eight Mile Road,95212,20.68,089-020-52,,,,No,8/14/2012,9/12/2012,Commercial,,"Agriculture and Forestry Resources, Land Use/Planning, Septic System, Transportation",,,,,,,,,,,,,,,,,
2012082051,San Joaquin County,,,PA-1200126,NEG,8/14/2012,,"A use permit application to expand the production capacity for an existing small winery into a large winery in two phases over ten years and to add marketing events for the winery.  The production capacity would increase from 36,000 gallons of wine per year.  Phase one includes the construction of six 3,000 gallon tanks and the addition of thirty marketing events per year with a maximum attendance of 100 people per marketing event.  Phase two includes the construction of a 12,000 sf case and barrel storage building and a 2,500 sf wine tasting room.",https://ceqanet.opr.ca.gov/2012082051,PA-1200126,Mo Hatef,San Joaquin County Community Dev Dept.,N/A,,1810 East Hazelton Avenue,,Stockton,CA,95205,2094688477,,Lodi,San Joaquin,,Locust Tree and SR 12,95240,,"051-120-36, 62",SR 12,Mokelumne River,,Yes,8/14/2012,9/12/2012,,Use Permit,"Agriculture and Forestry Resources, Land Use/Planning, Noise, Public Services, Transportation, Vegetation",,,,,,,,,,,,,,,,,
2012088168,California State University Board of Trustees,California State University Board of Trustees,,#013 Engineering - Re - Coat Decks - JOC 12-024.025.00,NOE,8/14/2012,8/14/2012,"The project consists of cleaning deck, gutter, drain and parapet wall to receive new coating. Light colored existing coating has no lead and dark coating has lead in the coating. This is not a hazardous waste site and all cleanup will be done pursuant to all applicable safety procedures for cleanup, handling and disposal.",https://ceqanet.opr.ca.gov/2012088168,#013 Engineering - Re - Coat Decks - JOC 12-024.025.00,Kristeen Eto de Gonzalez,California State University Board of Trustees,N/A,,California Polytechnic State University,,San Luis Obispo,CA,93407,8057562581,,San Luis Obispo,San Luis Obispo,,,,,,,,,,,,,,,,,Categorical Exemption,S:15301,Existing Facilities.,,,,,,,,,,,,
2012088169,California State University Board of Trustees,California State University Board of Trustees,,#015 Corp Admin - Fire Suppression Sysem -- JOC 12-024.022.00,NOE,8/14/2012,8/14/2012,"The project consists of revising fire alarm system, installing new sprinkler system, patching and painting where the wall is disturbed, and supplying any required testing of equipment.",https://ceqanet.opr.ca.gov/2012088169,#015 Corp Admin - Fire Suppression Sysem -- JOC 12-024.022.00,Kristeen Eto de Gonzalez,California State University Board of Trustees,N/A,,California Polytechnic State University,,San Luis Obispo,CA,93407,8057562581,,San Luis Obispo,San Luis Obispo,,,,,,,,,,,,,,,,,Categorical Exemption,S:15301,Existing Facilities.,,,,,,,,,,,,
2012088170,California State University Board of Trustees,California State University Board of Trustees,,#082 Corp Warehouse - Construction of a Fire Suppression System -- JOC 12-024.021.00,NOE,8/14/2012,8/14/2012,"The project consists of revising fire alarm equipment. installing new fire sprinkler system, and providing any required testing.",https://ceqanet.opr.ca.gov/2012088170,#082 Corp Warehouse - Construction of a Fire Suppression System -- JOC 12-024.021.00,Kristeen Eto de Gonzalez,California State University Board of Trustees,N/A,,California Polytechnic State University,,San Luis Obispo,CA,93407,8057562581,,San Luis Obispo,San Luis Obispo,,,,,,,,,,,,,,,,,Categorical Exemption,S:15301,Existing Facilities.,,,,,,,,,,,,
2012088171,California State University Board of Trustees,California State University Board of Trustees,,#110 Tenaya Hall - Re-roof Over Study Lounge-- JOC 12-024.017.00,NOE,8/14/2012,8/14/2012,"The project consists of removing and replacing roof with hot mop ballasted roof, match the existing rock.",https://ceqanet.opr.ca.gov/2012088171,#110 Tenaya Hall - Re-roof Over Study Lounge-- JOC 12-024.017.00,Kristeen Eto de Gonzalez,California State University Board of Trustees,N/A,,California Polytechnic State University,,San Luis Obispo,CA,93407,8057562581,,San Luis Obispo,San Luis Obispo,,,,,,,,,,,,,,,,,Categorical Exemption,S:15301,Existing Facilities.,,,,,,,,,,,,
2012088172,California State University Board of Trustees,California State University Board of Trustees,,GEN - Design & Construct Path of Travel between Parking Structure and Bldg. 43/43A -- JOC 12-024-016.00,NOE,8/14/2012,8/14/2012,"The project consists of replacing concrete sidewalks, ramps and parking area to provide and ADA path of travel between the main parking structure and 43/43A.",https://ceqanet.opr.ca.gov/2012088172,GEN - Design & Construct Path of Travel between Parking Structure and Bldg. 43/43A -- JOC 12-024-016.00,Kristeen Eto de Gonzalez,California State University Board of Trustees,N/A,,California Polytechnic State University,,San Luis Obispo,CA,93407,8057562581,,San Luis Obispo,San Luis Obispo,,,,,,,,,,,,,,,,,Categorical Exemption,S:15301,Existing Facilities.,,,,,,,,,,,,
2012088173,California State University Board of Trustees,California State University Board of Trustees,,#160E - Revise Foundation Excavation -- JOC 12-024.010.01,NOE,8/14/2012,8/14/2012,The project consists of excavation footings in rock.,https://ceqanet.opr.ca.gov/2012088173,#160E - Revise Foundation Excavation -- JOC 12-024.010.01,Kristeen Eto de Gonzalez,California State University Board of Trustees,N/A,,California Polytechnic State University,,San Luis Obispo,CA,93407,8057562581,,San Luis Obispo,San Luis Obispo,,,,,,,,,,,,,,,,,Categorical Exemption,S:15301,Existing Facilities.,,,,,,,,,,,,
2012088174,California State University Board of Trustees,California State University Board of Trustees,,#163 Sports Complex - Repave Basketball Court -- JOC 12-024.006.00,NOE,8/14/2012,8/14/2012,The project consists of removing the existing paving and replacing with base containing no recycled materials. Finish court surface and stripe.,https://ceqanet.opr.ca.gov/2012088174,#163 Sports Complex - Repave Basketball Court -- JOC 12-024.006.00,Kristeen Eto de Gonzalez,California State University Board of Trustees,N/A,,California Polytechnic State University,,San Luis Obispo,CA,93407,8057562581,,San Luis Obispo,San Luis Obispo,,,,,,,,,,,,,,,,,Categorical Exemption,S:15301,Existing Facilities.,,,,,,,,,,,,
2012088175,California State University Board of Trustees,California State University Board of Trustees,,GEN - Campus Way Parking Lot -- JOC 12-024.005.01,NOE,8/14/2012,8/14/2012,"The project consists of relocating water line for fire hydrant and irrigation, install new valve, cap and slurry gas line, install new conduit and relocate fiber for Charter, cut back shrubs along fence line.",https://ceqanet.opr.ca.gov/2012088175,GEN - Campus Way Parking Lot -- JOC 12-024.005.01,Kristeen Eto de Gonzalez,California State University Board of Trustees,N/A,,California Polytechnic State University,,San Luis Obispo,CA,93407,8057562581,,San Luis Obispo,San Luis Obispo,,,,,,,,,,,,,,,,,Categorical Exemption,S:15301,Existing Facilities.,,,,,,,,,,,,
2012088176,California State University Board of Trustees,California State University Board of Trustees,,#003 OCOB - Courtyard -- JOC 12-024.004.00,NOE,8/14/2012,8/14/2012,"The project consits of installing flatwork to widen walkway, with seat wall and additional seat wall at midpoint of lawn.",https://ceqanet.opr.ca.gov/2012088176,#003 OCOB - Courtyard -- JOC 12-024.004.00,Kristeen Eto de Gonzalez,California State University Board of Trustees,N/A,,California Polytechnic State University,,San Luis Obispo,CA,93407,8057562581,,San Luis Obispo,San Luis Obispo,,,,,,,,,,,,,,,,,Categorical Exemption,S:15301,Existing Facilities.,,,,,,,,,,,,
2012088177,California State University Board of Trustees,California State University Board of Trustees,,#006 PAC - Audio -- JOC 12-024.002.02,NOE,8/14/2012,8/14/2012,The project consists of providing equipment to core holes in the attic for audio system.,https://ceqanet.opr.ca.gov/2012088177,#006 PAC - Audio -- JOC 12-024.002.02,Kristeen Eto de Gonzalez,California State University Board of Trustees,N/A,,California Polytechnic State University,,San Luis Obispo,CA,93407,8057562581,,San Luis Obispo,San Luis Obispo,,,,,,,,,,,,,,,,,Categorical Exemption,S:15301,Existing Facilities.,,,,,,,,,,,,
2012088178,California State University Board of Trustees,California State University Board of Trustees,,#006 PAC - Audio -- JOC 12-024.002.01,NOE,8/14/2012,8/14/2012,The project consists of installing holes in attic and walls for AV equipment.,https://ceqanet.opr.ca.gov/2012088178,#006 PAC - Audio -- JOC 12-024.002.01,Kristeen Eto de Gonzalez,California State University Board of Trustees,N/A,,California Polytechnic State University,,San Luis Obispo,CA,93407,8057562581,,San Luis Obispo,San Luis Obispo,,,,,,,,,,,,,,,,,Categorical Exemption,S:15301,Existing Facilities.,,,,,,,,,,,,
2012088179,California State University Board of Trustees,California State University Board of Trustees,,#006 PAC - Audio -- JOC 12-024.002.00,NOE,8/14/2012,8/14/2012,The project consists of installing electrical and data conduits.,https://ceqanet.opr.ca.gov/2012088179,#006 PAC - Audio -- JOC 12-024.002.00,Kristeen Eto de Gonzalez,California State University Board of Trustees,N/A,,California Polytechnic State University,,San Luis Obispo,CA,93407,8057562581,,San Luis Obispo,San Luis Obispo,,,,,,,,,,,,,,,,,Categorical Exemption,S:15301,Existing Facilities.,,,,,,,,,,,,
2012088180,California State University Board of Trustees,California State University Board of Trustees,,#003 Business - Remodel Classroom 111 -- JOC 11-023.038.01,NOE,8/14/2012,8/14/2012,The project consists of installing owner supplied lighting and wattstopper system complete and programmed.,https://ceqanet.opr.ca.gov/2012088180,#003 Business - Remodel Classroom 111 -- JOC 11-023.038.01,Kristeen Eto de Gonzalez,California State University Board of Trustees,N/A,,California Polytechnic State University,,San Luis Obispo,CA,93407,8057562581,,San Luis Obispo,San Luis Obispo,,,,,,,,,,,,,,,,,Categorical Exemption,S:15301,Existing Facilities.,,,,,,,,,,,,
2012088181,California State University Board of Trustees,California State University Board of Trustees,,#114 Yosemite - YO Addressable Fire Alarms - Abatement -- JOC 11-023.035.01,NOE,8/14/2012,8/14/2012,"The project consists of lead point and asbestos containment for fire alarm project. Provide lead certified personnel to ensure proper procedures are taken to contain lead containing paint, provide proper abatement for holes in asbestos containing drywall. This is not a hazardous waste site and all cleanup will be done pursuant to all applicable safety procedures for cleanup, handling and disposal.",https://ceqanet.opr.ca.gov/2012088181,#114 Yosemite - YO Addressable Fire Alarms - Abatement -- JOC 11-023.035.01,Kristeen Eto de Gonzalez,California State University Board of Trustees,N/A,,California Polytechnic State University,,San Luis Obispo,CA,93407,8057562581,,San Luis Obispo,San Luis Obispo,,,,,,,,,,,,,,,,,Categorical Exemption,S:15301,Existing Facilities.,,,,,,,,,,,,
2012088182,California State University Board of Trustees,California State University Board of Trustees,,#113 Sierra Madre - SI Addressable Fire Alarms - Abatement -- JOC 11-023.034.01,NOE,8/14/2012,8/14/2012,"The project consists of lead paint and asbestos containment for fire alarm project. Provide lead certified personnel to ensure proper procedures are taken to contain lead containing paint, provide proper abatement for holes in asbestos containing drywall. This is not a hazardous waste site and all cleanup will be done pursuant to all applicable safety procedures for cleanup, handling and disposal.",https://ceqanet.opr.ca.gov/2012088182,#113 Sierra Madre - SI Addressable Fire Alarms - Abatement -- JOC 11-023.034.01,Kristeen Eto de Gonzalez,California State University Board of Trustees,N/A,,California Polytechnic State University,,San Luis Obispo,CA,93407,8057562581,,San Luis Obispo,San Luis Obispo,,,,,,,,,,,,,,,,,Categorical Exemption,S:15301,Existing Facilities.,,,,,,,,,,,,