SCH Number,Lead Agency Name,Lead Agency Title,Lead Agency Acronym,Document Title,Document Type,Received,Posted,Document Description,Document Portal URL,Project Title,Contact Full Name,Contact Authority,Contact Job Title,Contact Email Address,Contact Address  1,Contact Address  2,Contact City,Contact State,Contact Zip Code,Contact Phone Number,Location Coordinates,Cities,Counties,County Clerks,Location Cross Streets,Location Zip Code,Location Total Acres,Location Parcel Number,Location State Highways,Location Waterways,Location Airports,NOC Has Non Late Comment,NOC State Review Start Date,NOC State Review End Date,NOC Development Type,NOC Local Action,NOC Project Issues,NOC Local Review Start Date,NOC Local Review End Date,NOE Exempt Status,NOE Exempt Citation,NOE Reasons for Exemption,NOD Agency,NOD Approved By Lead Agency,NOD Approved Date,NOD Significant Environmental Impact,NOD Environmental Impact Report Prepared,NOD Negative Declaration Prepared,NOD Other Document Type,NOD Mitigation Measures,NOD Mitigation Reporting Or Monitoring Plan,NOD Statement Of Overriding Considerations Adopted,NOD Findings Made Pursuant,NOD Final EIR Available Location
1987110215,"South Lake Tahoe, City of",City of South Lake Tahoe,,EL DORADO COUNTY HAZARDOUS WASTE MANAGEMENT PLAN,NOD,12/22/1988,12/22/1988,HAZARDOUS WASTE MANGEMENT PLAN,https://ceqanet.opr.ca.gov/1987110215/3,EL DORADO COUNTY HAZARDOUS WASTE MANAGEMENT PLAN,TERI JAMIN,SOUTH LAKE TAHOE CITY,N/A,,PO BOX 1210,,SOUTH LAKE TAHOE,,95705,9165732025,,,El Dorado,,,,,,,,,,,,,,,,,,,,,,,Yes,Yes,No,,,,,,
1987111703,"Woodland, City of",City of Woodland,,DRAFT SUPPLEMENT TO CITY OF WOODLAND GP EIR,NOD,12/22/1988,12/22/1988,UPDATE OF GENERAL PLAN,https://ceqanet.opr.ca.gov/1987111703/3,DRAFT SUPPLEMENT TO CITY OF WOODLAND GP EIR,HOWARD NIES,WOODLAND CITY PLANNING DEPT,N/A,,300 FIRST ST,,WOODLAND,CA,95695,9166615820,,Woodland,Yolo,,,,,,113,,,,,,,,,,,,,,,,,Yes,Yes,No,,Yes,,Yes,,
1988032212,California State Lands Commission,,,LAUDER FIRE REHABILITATION/ROAD STABILIZATION/MAINTENANCE,NEG,12/22/1988,,"REHABILITATION OF FORESTED AREA AND ROADS ON ABOUT 800 ACRES BONDED IN THE LAUDER FIRE OF 1987. SITE PREPARATION INCLUDES REMOVAL OF FIRE KILLED VEGETATION, CLEANING/DEVELOPMENT OF WATER HOLES AND SPRINGS. ROAD STABIL IZATION AND MAINTENANCE: PULLING BERMS, OUTSLOPING ROAD BED, ELIMINATING DITCHES, ROCKING 6 MIL",https://ceqanet.opr.ca.gov/1988032212,LAUDER FIRE REHABILITATION/ROAD STABILIZATION/MAINTENANCE,DAN COHEN,CA ST LANDS COMMISSION,N/A,,,,,,,9163248497,,,"Lake, Mendocino",,,,            800,,,,,No,12/22/1988,1/20/1989,Other,,"Aesthetics, Cultural Resources, Flood Plain/Flooding, Hazards & Hazardous Materials, Hydrology/Water Quality, Noise, Vegetation, Wildfire, Wildlife",,,,,,,,,,,,,,,,,
1988060805,"Encinitas, City of",City of Encinitas,,ENCINATAS 2ND STREET OFFICE CONSTRUCTION (88-132 DR),NOD,12/22/1988,12/22/1988,"CONSTRUCTION OF ABOUT 11,600 S.F. OFFICE COMPLEX",https://ceqanet.opr.ca.gov/1988060805/2,ENCINATAS 2ND STREET OFFICE CONSTRUCTION (88-132 DR),TOM CURRIDEN,,N/A,,527 ENCINATAS BLVD,,ENCINATAS,CA,92024,6199445060,,,,,,,,,,,,,,,,,,,,,,,,,,No,No,Yes,,,,,,
1988062004,Kern County,,,ROSAMOND SPECIFIC PLAN REVISION,NOP,12/22/1988,,"THIS IS A PROPOSAL TO REVISE THE ROSAMOND SPECIFIC PLAN TEXT AND LAND USE MAP. TOTAL ACRES 12,040.",https://ceqanet.opr.ca.gov/1988062004,ROSAMOND SPECIFIC PLAN REVISION,FRED SIMON,KERN COUNTY,N/A,,,,,,,8058612615,,,,,,,"         12,040",,14,,ROSAMOND,No,12/23/1988,1/23/1989,"Commercial, Industrial, Residential",Specific Plan,"Aesthetics, Agriculture and Forestry Resources, Air Quality, Cultural Resources, Cumulative Effects, Economics/Jobs, Flood Plain/Flooding, Geology/Soils, Growth Inducement, Hazards & Hazardous Materials, Hydrology/Water Quality, Land Use/Planning, Mineral Resources, Noise, Population/Housing, Public Services, Schools/Universities, Septic System, Sewer Capacity, Social, Solid Waste, Transportation, Vegetation, Wildlife",,,,,,,,,,,,,,,,,
1988080223,"San Mateo, City of",City of San Mateo,,"CITY OF SAN MATEO GENERAL PLAN REVISIONS, HOUSING ELEMENT",NOD,12/22/1988,12/22/1988,REVISION OF GENERAL PLAN HOUSING ELEMENT,https://ceqanet.opr.ca.gov/1988080223/2,"CITY OF SAN MATEO GENERAL PLAN REVISIONS, HOUSING ELEMENT",ROBERT M. BROWN,SAN MATEO CITY PLANNING,N/A,,330 WEST 20TH AVENUE,,SAN MATEO,,94403,,,San Mateo,San Mateo,,,,,,"101,280,82","SAN FRAN BAY, MARINA",SAN FRANCISCO I,,,,,,,,,,,,,,,No,No,Yes,,,,,,
1988081516,Sierra Joint Community College District,,,SIERRA COLLEGE WESTERN NEVADA COUNTY CENTER,NOD,12/22/1988,12/22/1988,CONST/OPERATION OF COLLEGE CENTER EXXTENSION FOR 750 STUDNT,https://ceqanet.opr.ca.gov/1988081516/2,SIERRA COLLEGE WESTERN NEVADA COUNTY CENTER,RON BRYANT,SIERRA JOINT COMMUNITY COLLEGE DISTRICT,N/A,,5000 ROCKLIN ROAD,,ROCKLIN,,95677,9167810552,,Grass Valley,Nevada,,,,,35-25-09,20/49,,,,,,,,,,,,,,,,,No,Yes,No,,Yes,,,,
1988090709,"Encinitas, City of",City of Encinitas,,(88-270 DR/EIA) FULTON/SAWYER PROPERTIES,NOD,12/22/1988,12/22/1988,CONSTRUCTION OF 2 BLUFFTOP SINGLE FAMILY HOMES,https://ceqanet.opr.ca.gov/1988090709/2,(88-270 DR/EIA) FULTON/SAWYER PROPERTIES,TOM CURRIDEN,ENCINITAS CITY,N/A,,527 ENCINITAS BOULEVARD,,ENCINITAS,,92024,6199445065,,Encinitas,San Diego,,,,,256-282-24,101/5,,,,,,,,,,,,,,,,,No,No,Yes,,Yes,,,,
1988111506,"Richmond, City of",City of Richmond,,MARINA BAY PLANNED AREA FINAL DEVELOPMENT PLAN-5 OFFICE BLDG,NOD,12/22/1988,12/22/1988,CNOSTRUCT 4 OFFICE/FLEX COMMERCIAL BUILDINGS/991 PARKING,https://ceqanet.opr.ca.gov/1988111506/2,MARINA BAY PLANNED AREA FINAL DEVELOPMENT PLAN-5 OFFICE BLDG,KAREN L. HOWARD,RICHMOND CITY,N/A,,2600 BARRETT AVE,,RICHMOND,CA,94804,4156206706,,Richmond,Contra Costa,,,,,,580,SF BAY,,,,,,,,,,,,,,,,No,No,Yes,,,,,,
1988121912,"Parks and Recreation, Department of",California Department of Parks and Recreation,,DISPOSAL OF HUMAN SKELETAL REMAINS & BURIAL-RELATED ARTIFCTS,NOP,12/22/1988,,"THE DEPT. OF PARKS AND RECREATION IS PREPARING AN EIR FOR THE DISPOSITION OF THE BURIAL COLLECTIONS IN ITS CUSTODY, INCLUDING HUMAN SKELETAL REMAINS A THESE MATERIALS ARE PRIMARILY NATIVE AMERICAN IN ORIGIN AND WERE ORIGINALLY GATHERED FROM MANY DIFFERENT LOCATIONS IN CALIFORNIA.",https://ceqanet.opr.ca.gov/1988121912,DISPOSAL OF HUMAN SKELETAL REMAINS & BURIAL-RELATED ARTIFCTS,JAMES M. DOYLE,CA ST DEPT PARKS & RECREATION,N/A,,,,,,,9163246421,,,,,,,,,,,,No,12/22/1988,1/20/1989,,,Cultural Resources,,,,,,,,,,,,,,,,,
1988122012,Fish and Game (HQ) Environmental Services,,,MANAGEMENT PLAN FOR GRAY LODGE WILDLIFE AREA,NEG,12/22/1988,,"MANAGEMENT PLAN FOR WILDLIFE AREA FOR PROTECTION AND ENHANCE MENT OF HABITAT FOR WATER FOWL, UPLAND GAME, NONGAME AND THREATENED AND ENDANGERED PLANTS A NTS A LONG RANGE GOALS, SPECIFIC OBJECTIVES AND JOB TASKS TO INCREASE AND ENHANCE WETLAND, RIPARIAN, AND UPLAND HABITATS.",https://ceqanet.opr.ca.gov/1988122012,MANAGEMENT PLAN FOR GRAY LODGE WILDLIFE AREA,AREA MANAGER,CA ST FISH AND GAME,N/A,,,,,,,9168463315,,Gridley,"Butte, Sutter",,,,"          8,400",,99,,,No,12/22/1988,1/20/1989,Other,,"Agriculture and Forestry Resources, Flood Plain/Flooding, Hydrology/Water Quality, Vegetation, Wetland/Riparian, Wildlife",,,,,,,,,,,,,,,,,
1988122013,Monterey County,,,HARRIS MINOR SUBDIVISION,NEG,12/22/1988,,SUBIDIVISION OF 3.78 PARCELS INTO 2.2 ACRE AND 1.6 ACRE FOR EACH OF THE 2 EXISTING DWELLINGS.,https://ceqanet.opr.ca.gov/1988122013,HARRIS MINOR SUBDIVISION,KELLIE D. MORGANTINI,MONTEREY COUNTY PLANNING,N/A,,,,,,,4087555025,,,Monterey,,SAMBRIA & PORTOLA,,              4,008-292-11,68,,,No,12/22/1988,1/20/1989,Residential,"Land Division (Subdivision, etc.)","Aesthetics, Air Quality, Coastal Zone, Cultural Resources, Geology/Soils, Growth Inducement, Hazards & Hazardous Materials, Hydrology/Water Quality, Septic System, Transportation, Vegetation, Wetland/Riparian, Wildfire, Wildlife",,,,,,,,,,,,,,,,,
1988122014,Siskiyou County,,,STURGESS TENTATIVE PARCEL MAP,NEG,12/22/1988,,CREATE 2 PARCELS AND A FUTURE BUILDING SITE.,https://ceqanet.opr.ca.gov/1988122014,STURGESS TENTATIVE PARCEL MAP,MARTY TAYLOR,SISKIYOU COUNTY,N/A,,,,,,,9168428200,,,Siskiyou,,SALMON RIVER ROAD,,             39,33-320-010,,SALMON RIVER,,No,12/22/1988,1/20/1989,Residential,"Land Division (Subdivision, etc.)","Aesthetics, Cultural Resources, Flood Plain/Flooding, Hydrology/Water Quality, Septic System, Vegetation",,,,,,,,,,,,,,,,,
1988122015,Contra Costa County,,,"ALAMO SUMMIT, COUNTY FILE 2776-RZ",EIR,12/22/1988,,A REQUEST FOR FINAL DEVELOPMENT PLAN APPROVAL FOR A 37 UNIT SINGLE-FAMILY RESIDENTAIL PROJECT. SUBDIVISION 7553:  A REQUEST FOR VESTING TENTATIVE MAP AP- PROVAL TO SUBDIVIDE 176 ACRES INTO 37 LOTS.,https://ceqanet.opr.ca.gov/1988122015,"ALAMO SUMMIT, COUNTY FILE 2776-RZ",ROBERT DRAKE,CONTRA COSTA COUNTY,N/A,,,,,,,4156462091,,Alamo,Contra Costa,,,,            176,191-140-005,I-680,,,No,12/22/1988,2/6/1989,Residential,,"Aesthetics, Geology/Soils, Vegetation, Wetland/Riparian, Wildfire, Wildlife",,,,,,,,,,,,,,,,,
1988122016,"Alameda, City of",City of Alameda,,HARBOR BAY LANDING,NEG,12/22/1988,,"DIVIDE A 1.5 ACRE PARCEL INTO 4 PARCELS TO CONSTRUCT A CHUR CH AS DESIGNATED FOR THE SITE UNDER PLANNED DEVELOPMENT PD- 76-2, FOR HARBOR BAY LANDING ON 1 OTHER 3 LOTS FOR THE HARBOR BAY COMMUNITY CENTER AND OFFICES OF THE COMMUNITY ASSOCIATION, AND COMMON OPEN SPACE.",https://ceqanet.opr.ca.gov/1988122016,HARBOR BAY LANDING,XANDRA GRUBE,ALAMEDA CITY,N/A,,,,,,,4157484554,,Alameda,Alameda,,,,              2,,,,,No,12/22/1988,1/20/1989,,,"Flood Plain/Flooding, Noise, Transportation",,,,,,,,,,,,,,,,,
1988122017,"San Jose, City of",City of San Jose,,GUADALUPE RIVER PARK,NOP,12/22/1988,,THE PROJECT CONSISTS OF A MP DESIGN REFINEMENT FOR THE GUAD- ALUPE RIVER PARK. THE PROJECT WOULD ADD LOCAL BETTERMENTS TO AN APPROVED US DEPT COE FLOOD CONT EAR PATTERN OF OPEN SPACE WOULD INTEGRATE RECREATIONAL AND CULTURAL ACTIVITIES WITH SURROUNDING LAND USES. 4 ELEMENTS OR SYSTEMS HAVE BEEN INCORPORATED,https://ceqanet.opr.ca.gov/1988122017,GUADALUPE RIVER PARK,LAUREL PREVETTI,SAN JOSE CITY PLANNING,N/A,,,,,,,4082774576,,San Jose,Santa Clara,,VIRGINIA/SR 87/880,,            205,,87,,SJ INTERN'L,No,12/23/1988,1/23/1989,Other,"General Plan Amendment, Master Plan","Aesthetics, Air Quality, Cultural Resources, Cumulative Effects, Flood Plain/Flooding, Geology/Soils, Hazards & Hazardous Materials, Hydrology/Water Quality, Noise, Public Services, Sewer Capacity, Solid Waste, Transportation, Vegetation, Wetland/Riparian, Wildfire, Wildlife",,,,,,,,,,,,,,,,,
1988122020,"Rohnert Park, City of",City of Rohnert Park,,NORTHWEST ROHNERT PARK PROGRAM,NOP,12/22/1988,,PROJECT CONSISTS OF 38.4 AC. OF COMMERCIAL LAND TO BE DEVELOPED IN STAGES OVER A SEVERAL YEAR PERIOD.  THE PROPERTY IS LOCATED ON THE NORTH AND SOUTH SIDES OF GOLF COURSE DRIVE EAST OF U.S. 101 FREEWAY.,https://ceqanet.opr.ca.gov/1988122020,NORTHWEST ROHNERT PARK PROGRAM,PAUL SKANCHY,ROHNERT PARK,N/A,,,,,,,7077952411,,Rohnert Park,Sonoma,,ROBERTS LAKE/S. SANTA ROSA,,             38,,101,,,No,12/23/1988,1/23/1989,"Commercial, Office, Transportation","Community Plan, Site Plan, Specific Plan, Use Permit","Air Quality, Cumulative Effects, Flood Plain/Flooding, Geology/Soils, Growth Inducement, Hydrology/Water Quality, Noise, Public Services, Transportation, Vegetation, Wildlife",,,,,,,,,,,,,,,,,
1988122303,"Agriculture, United States Department of",United States Department of Agriculture,USDA,EUGENE O'NEILL NATIONAL HISTORIC SITE GENERAL MGMT. PLAN,EIS,12/22/1988,,GENERAL MANAGEMENT PLAN FOR THE EUGENE O'NEILL NATIONAL HISTORIC SITE THAT WILL GUIDE THE SITE'S MANAGEMENT AND DEVELOPMENT FOR THE NEXT TEN YEARS,https://ceqanet.opr.ca.gov/1988122303,EUGENE O'NEILL NATIONAL HISTORIC SITE GENERAL MGMT. PLAN,SUPERINTENDENT,US NATIONAL PARK SERVICE/O'NEILL NAT. HIST. SITE,N/A,,,,,,,,,Martinez,Contra Costa,,STARVIEW DR/DEL AMIGO RD,,,,,,,No,12/22/1988,3/8/1989,Other,,"Aesthetics, Cultural Resources, Geology/Soils, Vegetation, Wildlife",,,,,,,,,,,,,,,,,
1988122383,"Parks and Recreation, Department of",California Department of Parks and Recreation,,DEMOLITION OF STRUCTURED,NOE,12/22/1988,12/22/1988,DEMOLISH SMALL STRUCTURE FOR WELL PUMP AND CONTROLS,https://ceqanet.opr.ca.gov/1988122383,DEMOLITION OF STRUCTURED,JAMES M. DOYLE,CA ST DEPT P,N/A,,PO BOX 942896-0001,,SACRAMENTO,CA,94286,9163246421,,,San Luis Obispo,,,,,,,,,,,,,,,,,Categorical Exemption,,,,,,,,,,,,,,
1988122584,"Parks and Recreation, Department of",California Department of Parks and Recreation,,DEMOLITION OF STRUCTURE,NOE,12/22/1988,12/22/1988,DEMOLISH WOOD FRAME RESIDENCE ON PEDRO RANCH PROPERTY,https://ceqanet.opr.ca.gov/1988122584,DEMOLITION OF STRUCTURE,JAMES M. DOYLE,CA ST DEPT P,N/A,,PO BOX 942896-0001,,SACRAMENTO,CA,94286,9163246421,,,San Luis Obispo,,,,,,,,,,,,,,,,,Categorical Exemption,,,,,,,,,,,,,,
1988122585,"Parks and Recreation, Department of",California Department of Parks and Recreation,,PLAZA HALL DECK REPAIRS,NOE,12/22/1988,12/22/1988,REPLACE WOOD DECK BOARDS ON PORCH,https://ceqanet.opr.ca.gov/1988122585,PLAZA HALL DECK REPAIRS,JAMES M. DOYLE,CA ST DEPT P,N/A,,PO BOX 942896-0001,,SACRAMENTO,CA,94286,9163246421,,,San Benito,,,,,,,,,,,,,,,,,Categorical Exemption,,,,,,,,,,,,,,
1988122586,"Parks and Recreation, Department of",California Department of Parks and Recreation,,ROAD REPAIR,NOE,12/22/1988,12/22/1988,REMOVE MUD SLIDES FROM KAISER-AETNA ROAD BTWN BELL STATION DOWDY RANCH,https://ceqanet.opr.ca.gov/1988122586,ROAD REPAIR,JAMES M. DOYLE,CA ST DEPT P,N/A,,PO BOX 942896-0001,,SACRAMENTO,CA,94286,9163246421,,,Santa Clara,,,,,,,,,,,,,,,,,Categorical Exemption,,,,,,,,,,,,,,
1988122587,"Parks and Recreation, Department of",California Department of Parks and Recreation,,BEACH ACCESS,NOE,12/22/1988,12/22/1988,INSTALL PIER/PAD FOR BEACH ACCESS STAIRWAY,https://ceqanet.opr.ca.gov/1988122587,BEACH ACCESS,JAMES M. DOYLE,CA ST DEPT P,N/A,,PO BOX 942896-0001,,SACRAMENTO,CA,94286,9163246421,,,San Mateo,,,,,,,,,,,,,,,,,Categorical Exemption,,,,,,,,,,,,,,
1988122588,"Parks and Recreation, Department of",California Department of Parks and Recreation,,ORESTIMBA WELL,NOE,12/22/1988,12/22/1988,FILL IN WELL TO REDUCE HAZARD TO VISITORS,https://ceqanet.opr.ca.gov/1988122588,ORESTIMBA WELL,JAMES M. DOYLE,CA ST DEPT P,N/A,,PO BOX 942896-0001,,SACRAMENTO,CA,94286,9163246421,,,Stanislaus,,,,,,,,,,,,,,,,,Categorical Exemption,,,,,,,,,,,,,,
1988122590,Lake County,,,IS 88-62/RZ 88-31 DALE TWOMLEY,NOD,12/22/1988,12/22/1988,REZONE OF 640 ACRES FROM CR-83 TO RL-WW,https://ceqanet.opr.ca.gov/1988122590,IS 88-62/RZ 88-31 DALE TWOMLEY,LINDA HEDSTROM,,N/A,,255 N FORBES ST,,LAKEPORT,CA,95453,7072632221,,,Lake,,,,,,,,,,,,,,,,,,,,,,,No,No,Yes,,,,,,
1988122591,"Encinitas, City of",City of Encinitas,,88-225 DR/EIA,NOD,12/22/1988,12/22/1988,CONSTRUCTION OF BLUFFTOP DUPLEX ON VACANT SITE,https://ceqanet.opr.ca.gov/1988122591,88-225 DR/EIA,TOM CURRIDEN,,N/A,,527 ENCINATAS BLVD,,ENCINATAS,CA,92024,6199445060,,,,,,,,,,,,,,,,,,,,,,,,,,No,No,Yes,,Yes,,,,
1988122592,"Public Health, Department of",California Department of Public Health,CDPH,BUILDING 25/CORROSION CENTER FAC/INDUSTRIAL WASTE FAC 25,NOD,12/22/1988,12/22/1988,CONST/OPERATION OF PAINT STRIPPING HANGAR/WASTE TRMT PLANT,https://ceqanet.opr.ca.gov/1988122592,BUILDING 25/CORROSION CENTER FAC/INDUSTRIAL WASTE FAC 25,DANIEL E. MURPHY,CA ST HEALTH SRVICES/TOXIC SUBSTANCES CONT,N/A,,"2151 BERKELEY WAY, ANNEX 7",,BERKELEY,,94704,4155403545,,,Alameda,,,,,,,,,,,,,,,,,,,,,,,No,No,Yes,,Yes,,,,
1989010408,California State University Board of Trustees,California State University Board of Trustees,,SAN DEIGO STATE UNIVERSITY/STUDENT ACTIVITIES CENTER,NOP,12/22/1988,,"STUDENT ACTIVITY CENTER CONSISTING OF A STUDENT RECREATIONAL FACILITIES FOR INTRAMURALS, SPORTS AND INFORMAL RECREATION.",https://ceqanet.opr.ca.gov/1989010408,SAN DEIGO STATE UNIVERSITY/STUDENT ACTIVITIES CENTER,SUSAN M. ALDRICH,CA STATE UNIVERSITY,N/A,,,,,,,2139859489,,Long Beach,Los Angeles,,,,,,,,,No,1/5/1989,2/3/1989,Educational,,"Flood Plain/Flooding, Geology/Soils, Transportation",,,,,,,,,,,,,,,,,
1989011611,Tulare County,,,PAC 88-03 TULARE COUNTY,CON,12/22/1988,,REZONE PROPERTY TO M-2 FOR FUTURE HEAVY INDUSTRIAL DEVELOP- MENT. THIS APPLICATION IS REQUIRED FOR CANCELLATION OF THE AGRICULTURAL PRESERVE CONTRACT.,https://ceqanet.opr.ca.gov/1989011611,PAC 88-03 TULARE COUNTY,FRANK J. GOMEZ,TULARE COUNTY,N/A,,,,,,,2097336254,,,Tulare,,E STREET & GAIL AVE,,             34,164-100-08,99,,,No,1/18/1989,1/13/1989,,Williamson Act Cancellation,Agriculture and Forestry Resources,,,,,,,,,,,,,,,,,
