SCH Number,Lead Agency Name,Lead Agency Title,Lead Agency Acronym,Document Title,Document Type,Received,Posted,Document Description,Document Portal URL,Project Title,Contact Full Name,Contact Authority,Contact Job Title,Contact Email Address,Contact Address  1,Contact Address  2,Contact City,Contact State,Contact Zip Code,Contact Phone Number,Location Coordinates,Cities,Counties,County Clerks,Location Cross Streets,Location Zip Code,Location Total Acres,Location Parcel Number,Location State Highways,Location Waterways,Location Airports,NOC Has Non Late Comment,NOC State Review Start Date,NOC State Review End Date,NOC Development Type,NOC Local Action,NOC Project Issues,NOC Local Review Start Date,NOC Local Review End Date,NOE Exempt Status,NOE Exempt Citation,NOE Reasons for Exemption,NOD Agency,NOD Approved By Lead Agency,NOD Approved Date,NOD Significant Environmental Impact,NOD Environmental Impact Report Prepared,NOD Negative Declaration Prepared,NOD Other Document Type,NOD Mitigation Measures,NOD Mitigation Reporting Or Monitoring Plan,NOD Statement Of Overriding Considerations Adopted,NOD Findings Made Pursuant,NOD Final EIR Available Location
1984050901,Santa Ana Watershed Project Authority,,SAWPA,ELSINORE LAKE MANAGEMENT PROJECT,EIR,7/20/1987,,"MULTI-PURPOSE WATER RESOURCES MANAGEMENT PLAN TO STABILIZE LAKE ELSINORE AND CREATE A PERMANENT BODY OF WATER BOUNDED BY A RECREATIONAL FACILITY AND A W A LEVEE WILL BE CONSTRUCTED ACROSS THE LAKE, INLET AND OUTLET CHANNELS WILL BE RELOCATED, AND OTHER IMPROVEMENTS WILL ACCOMPLISH TO STABILIZE THE L",https://ceqanet.opr.ca.gov/1984050901,ELSINORE LAKE MANAGEMENT PROJECT,WILLIAM DYER,SAWPA,N/A,,,,,,,7147855411,,Lake Elsinore,Riverside,,,,,,,,,No,7/22/1987,9/5/1987,Other,,"Aesthetics, Agriculture and Forestry Resources, Air Quality, Cultural Resources, Flood Plain/Flooding, Geology/Soils, Growth Inducement, Hydrology/Water Quality, Vegetation, Wetland/Riparian, Wildlife",,,,,,,,,,,,,,,,,
1985091815,"El Segundo, City of",City of El Segundo,,EL SEGUNDO ZONE CHANGE FROM M-2 TO C-M,EIR,7/20/1987,,"CITY-INITIATED REZONING OF AN APPROXIMATELY 14.7 ACRE SITE FROM HEAVY MANUFACTURING TO COMMERCIAL MANUFACTURING. MAXIMUM DEVELOPMEN POTENTIAL WOULD SQ FT TO 1,800,000 SQ FT. STRUCTURES.",https://ceqanet.opr.ca.gov/1985091815/3,EL SEGUNDO ZONE CHANGE FROM M-2 TO C-M,LYNN HARRIS,EL SEGUNDO CITY,N/A,,,,,,,213-322-4670X256,,El Segundo,Los Angeles,,,,             15,,1,,LAX,No,7/22/1987,8/21/1987,"Office, Other","General Plan Amendment, Land Division (Subdivision, etc.), Master Plan, Rezone, Specific Plan","Aesthetics, Air Quality, Cumulative Effects, Flood Plain/Flooding, Growth Inducement, Hydrology/Water Quality, Land Use/Planning, Noise, Public Services, Schools/Universities, Sewer Capacity, Solid Waste, Transportation, Wildfire",,,,,,,,,,,,,,,,,
1986040810,Marin County,,,REVISED SOLID WASTE MANAGEMENT PLAN,NEG,7/20/1987,,PROPOSED AMENDMENTS TO MARIN COUNTY SOLID WASTE MANAGEMENT PLAN PURSUANT TO THE REQUIREMENTS BY CA WASTE MANAGEMENT BOARD.,https://ceqanet.opr.ca.gov/1986040810,REVISED SOLID WASTE MANAGEMENT PLAN,RICK BORGWARDT,MARIN COUNTY PLANNING DEPARTMENT,N/A,,,,,,,4154996269,,,Marin,,,,,,,,,No,7/22/1987,8/21/1987,,"Specific Plan, Waste Management Plan","Aesthetics, Agriculture and Forestry Resources, Air Quality, Cultural Resources, Cumulative Effects, Geology/Soils, Growth Inducement, Hazards & Hazardous Materials, Hydrology/Water Quality, Land Use/Planning, Noise, Public Services, Septic System, Sewer Capacity, Social, Solid Waste, Vegetation, Wetland/Riparian, Wildlife",,,,,,,,,,,,,,,,,
1986102909,"Azusa, City of",City of Azusa,,WEST END SPECIFIC PLAN,EIR,7/20/1987,,"SPECIFIC PLAN DESIGNED TO GUIDE THE ORDERLY MODERNIZATION OF THE WEST END INDUSTRIAL PARK INTO A DISTRICT OF HIGH QUALITY INDUSTRIAL AND COMMERCIAL THE AREA'S ECONOMIC VIBRANCY AND URBAN SMALL BUSINESS CHARACTER. THE PLAN DOES THIS THROUGH A SET OF LAND USE, DESIGN, AND REHABILITATION STRATEG",https://ceqanet.opr.ca.gov/1986102909/2,WEST END SPECIFIC PLAN,TINA KATCHEN-GALL,AZUSA CITY REDEVELOPMENT AGENCY,N/A,,,,,,,8183345125,,Azusa,Los Angeles,,,,             66,,39,,,No,7/21/1987,9/4/1987,"Commercial, Industrial, Other","Redevelopment, Specific Plan","Aesthetics, Air Quality, Cumulative Effects, Economics/Jobs, Flood Plain/Flooding, Geology/Soils, Growth Inducement, Hydrology/Water Quality, Land Use/Planning, Mineral Resources, Noise, Public Services, Septic System, Sewer Capacity, Social, Transportation, Wildfire",,,,,,,,,,,,,,,,,
1986112408,Mono County,,,MAMMOTH PACIFIC II & III GEOTHERMAL PROJECT,EIR,7/20/1987,,"TWO 10 MW BINARY CYCLE GEOTHERMAL ELECTRICAL GENERATING FACILITIES TO PRODUCE FOR SOUTHERN CA EDISON GY, INC AND UNDER GEOTHERMAL LEASE UNIT WILL OCCUPY ABOUT 2 ACRES AND WILL BE ADJACENT TO EACH OTHER. THE UNITS WIL BE SUPPLIED GEOTHERMAL RESOURCES FROM GEOTHERMAL PRODUCTION WELLS.",https://ceqanet.opr.ca.gov/1986112408/2,MAMMOTH PACIFIC II & III GEOTHERMAL PROJECT,DAN LYSTER,MONO COUNTY ENERGY DEPARTMENT,N/A,,,,,,,6199346704,,Mammoth Lakes,Mono,,US 395,,,,203,,MAMMOTH,No,7/20/1987,9/3/1987,"Other, Power",,"Aesthetics, Air Quality, Coastal Zone, Cultural Resources, Cumulative Effects, Geology/Soils, Growth Inducement, Hazards & Hazardous Materials, Hydrology/Water Quality, Mineral Resources, Noise, Public Services, Transportation, Vegetation, Wetland/Riparian, Wildfire, Wildlife",,,,,,,,,,,,,,,,,
1987021711,"Public Utilities Commission, California",California Public Utilities Commission,CPUC,VINEYARD 230 KV TANSMISSION LINE,EIR,7/20/1987,,"A 5.9 MI ALL UNDERGROUND 230 KV DOUBLE CIRCUIT TRANSMISSION LINE BETWEEN THE VINEYARD SUBSTARTION IN PLEASANTON TO THE TESLA-NEWARK 230 KV LINE IN ALAMED 1.6 MILES OF THE LINE PLACE UNDERGROUND THROUGH PLEASANTON. THE LAND USES IN PLEASANTON ARE PRIMARILY RESIDENTIAL, WHILE THE COUNTY PROPERTY IS OPEN SPACE",https://ceqanet.opr.ca.gov/1987021711,VINEYARD 230 KV TANSMISSION LINE,ELAINE RUSSELL,CA ST PUBLIC UTILITIES COMMISSION,N/A,,,,,,,9163246195,,Pleasanton,Alameda,,,,,,84,,LIVERMORE,No,7/20/1987,9/3/1987,Power,,"Aesthetics, Agriculture and Forestry Resources, Air Quality, Cultural Resources, Cumulative Effects, Economics/Jobs, Flood Plain/Flooding, Geology/Soils, Growth Inducement, Hazards & Hazardous Materials, Land Use/Planning, Noise, Transportation, Vegetation, Wetland/Riparian, Wildfire, Wildlife",,,,,,,,,,,,,,,,,
1987032413,"Lodi, City of",City of Lodi,,LODI EAST SIDE RESIDENTIAL DENSITY STUDY AND PLAN,EIR,7/20/1987,,"IDENTIFIES LONG-RANGE PLANNING OPTIONS OF THE EAST SIDE OF LODI. THE PROJECT WOULD ENTAIL ADOPTION AND IMPLEMENTATION OF GENERAL PLAN POLICY CHANGES, RE AD THE ADOPTION OF PERFORMANCE STANDARDS BY THE CITY AND WILL PROVIDE DIRECTION FOR THE FUTURE GROWTH/DEVELOPMENT OF THE STUDY AREA.",https://ceqanet.opr.ca.gov/1987032413,LODI EAST SIDE RESIDENTIAL DENSITY STUDY AND PLAN,ERIN MACLEAN,LODI CITY,N/A,,,,,,,2093345634,,Lodi,San Joaquin,,,,,,99,,,No,7/21/1987,8/20/1987,Residential,"General Plan Amendment, Rezone","Aesthetics, Cumulative Effects, Economics/Jobs, Flood Plain/Flooding, Growth Inducement, Hydrology/Water Quality, Land Use/Planning, Noise, Public Services, Schools/Universities, Sewer Capacity, Transportation, Wildfire",,,,,,,,,,,,,,,,,
1987032517,"San Diego, City of",City of San Diego,,CARROLL CENTER II,EIR,7/20/1987,,"THE PROJECT PROPOSES TO PHASE DEVELOPMENT OF THE 302.5 ACRE SITE OVER A 15-20 YEAR PERIOD WITH A MIX OF INDUSTRIAL, COMMERCIAL, AND RESIDE WOULD OCCUR PER THE SPECIFIC PLAN AND WOULD REQUIRE SUBSEQUENT SUBMITTAL OF INDIVIDUAL PLANNED DEVELOPMENT PERMITS FOR EACH DEVELOPMENT AREA.",https://ceqanet.opr.ca.gov/1987032517,CARROLL CENTER II,MARY LADIANA,SAN DIEGO CITY,N/A,,,,,,,6192365904,,,San Diego,,CAMINO RUIZ/BLACK MOUNTAIN RD,,,,I-15,,MIRAMAR NAS,No,7/21/1987,8/20/1987,"Commercial, Industrial, Office, Residential","Community Plan, General Plan Amendment, Land Division (Subdivision, etc.), Rezone, Specific Plan","Aesthetics, Air Quality, Cumulative Effects, Flood Plain/Flooding, Geology/Soils, Land Use/Planning, Mineral Resources, Noise, Public Services, Schools/Universities, Transportation, Vegetation, Wetland/Riparian, Wildlife",,,,,,,,,,,,,,,,,
1987040108,"San Diego, Port of",,,LA PLAY PIERS PLAN AMENDMENT,EIR,7/20/1987,,PROPOSED PLAN AMENDMENT TO THE PORT MASTER PLAN CONSISTING SOLELY OF THE DELETION OF THE COASTAL COMMISSION CERTIFICATION CONDITION #1 REGARDI LOCATED WITHIN DISTRICT TIDELANDS ALONG THE WESTERN SHORE- LINE OF THE SHELTER ISLAND YACHT BASIN. THIS ACTION WILL RETURN TO THE DISTRICT ITS FORMER,https://ceqanet.opr.ca.gov/1987040108,LA PLAY PIERS PLAN AMENDMENT,TOMAS E. FIRLE,SAN DIEGO UNIFIED PORT DISTRICT,N/A,,,,,,,6192913900,,,San Diego,,ROSECRANS/TALBOT/KELLOGG,,,,,SAN DIEGO RIVER,LINDBERGH,No,7/24/1987,9/8/1987,Recreational,,"Coastal Zone, Cultural Resources, Growth Inducement, Land Use/Planning, Transportation",,,,,,,,,,,,,,,,,
1987040717,Napa County,,,PARCEL MAP 2416-PM/JAMES SILVA ET AL /607 ACRES / SILVA,EIR,7/20/1987,,"DIVISION OF PROPERTY INTO 11 PARCELS IN AN AGRICULTURAL WATERSHED ZONING DISTRICT/APN 32-100-02,25. THE PROJECT IS LOCATED ON THE EAST SIDE OF STATE MILES SOUTH OF BERRYESSA-KNOXVILLE ROAD (TOTAL OF 607 ACRES)",https://ceqanet.opr.ca.gov/1987040717,PARCEL MAP 2416-PM/JAMES SILVA ET AL /607 ACRES / SILVA,"JAMES H. HICKEY, DIRECTOR",NAPA COUNTY PLANNING DEPARTMENT,N/A,,,,,,,7072534416,,,Napa,,BERRYESSA-KNOXVILLE ROAD,,            607,"32-100-02,25",128,,,No,7/20/1987,9/3/1987,Residential,"Land Division (Subdivision, etc.)","Aesthetics, Flood Plain/Flooding, Geology/Soils, Growth Inducement, Hydrology/Water Quality, Noise, Septic System, Transportation, Wildfire",,,,,,,,,,,,,,,,,
1987060216,"Livermore, City of",City of Livermore,,AMEND POPULATION & GROWTH POLICIES OF LIVERMORE GENERAL PLAN,EIR,7/20/1987,,AMEND LIVERMORE COMMUNITY GENERAL PLAN 1976-2000 TO REFLECT CHANGES IN CITY'S POPULATION & GROWTH MANAGEMENT POLICIES. REPLACE CURRENT POLICY OF MAXIMUM WITH POLICY PERMITTING A RANGE OF GROWTH FROM 1-1/2 TO 3-1/2.,https://ceqanet.opr.ca.gov/1987060216,AMEND POPULATION & GROWTH POLICIES OF LIVERMORE GENERAL PLAN,DAVID R CLEMENS,LIVERMORE CITY PLANNING DEPT,N/A,,,,,,,4154494003,,Livermore,Alameda,,,,,,,,,No,7/20/1987,9/3/1987,Other,General Plan Amendment,"Agriculture and Forestry Resources, Air Quality, Cultural Resources, Cumulative Effects, Economics/Jobs, Flood Plain/Flooding, Geology/Soils, Growth Inducement, Hydrology/Water Quality, Noise, Public Services, Schools/Universities, Sewer Capacity, Solid Waste, Transportation, Vegetation, Wetland/Riparian, Wildfire, Wildlife",,,,,,,,,,,,,,,,,
1987062905,Kern County,,,"BRUMMETT (ZCC#17, CUP#10, PM#8344, MAP#206)",NEG,7/20/1987,,"A PROPOSED ZONE CHANGE FROM A-1 (LIMITED AG) TO NR5 (NATURAL RESOURCE, 5 ACRE. MINIMUM) AND A PARCEL MAP TO CREATE 4-5 ACRE PARCELS FOR DEVELOPMENT INTO IES. WATER BY WEST KERN WATER DISTRICT; SEWAGE DISPOSAL BY INDIVIDUAL SEPTIC SYSTEMS.",https://ceqanet.opr.ca.gov/1987062905,"BRUMMETT (ZCC#17, CUP#10, PM#8344, MAP#206)",FRED SIMON,KERN COUNTY PLANNING AND DEVELOPMENT SERVICES,N/A,,,,,,,8058612615,,Maricopa,Kern,,HWY 166/SHORT RD,,             20,239-030-10,166/33,,,No,7/21/1987,8/21/1987,Industrial,"Land Division (Subdivision, etc.), Rezone",,,,,,,,,,,,,,,,,,
1987072001,Lassen County,,,DOYLE PARK,NEG,7/20/1987,,"PROPOSE TO ESTABLISH A COMMUNITY PARK ON A 4.5 ACRE SECTION OF A 10.7 ACRE PARCEL IN DOYLE.  DEVELOPMENT INCLUDES: BALL FIELD, 50-SEAT BLEACHER, PICNIC AR AND PARKING AREA.",https://ceqanet.opr.ca.gov/1987072001,DOYLE PARK,ROBERT SORVAAG,LASSEN COUNTY,N/A,,,,,,,9162578311,,,Lassen,,,,              5,141-350-60,US395,,,No,7/20/1987,8/19/1987,Recreational,"Land Division (Subdivision, etc.), Use Permit","Aesthetics, Coastal Zone, Cumulative Effects, Geology/Soils, Growth Inducement, Hazards & Hazardous Materials, Hydrology/Water Quality, Mineral Resources, Noise, Public Services, Vegetation, Wetland/Riparian, Wildfire, Wildlife",,,,,,,,,,,,,,,,,
1987072002,"Redlands, City of",City of Redlands,,TENTATIVE TRACT 13294,EIR,7/20/1987,,AN APPLICATION TO SUBDIVIDE APPROXIMATELY 260 ACRES ACRES INTO 304 LOTS FOR SINGLE FAMILY DETACHED RESIDENCES.,https://ceqanet.opr.ca.gov/1987072002,TENTATIVE TRACT 13294,RICHARD BOBERTZ,REDLANDS CITY,N/A,,,,,,,7147987555,,Redlands,San Bernardino,,,,            260,,I10,,,No,7/20/1987,9/3/1987,Residential,"Land Division (Subdivision, etc.)","Aesthetics, Air Quality, Cumulative Effects, Geology/Soils, Growth Inducement, Hydrology/Water Quality, Noise, Public Services, Schools/Universities, Transportation, Vegetation, Wildlife",,,,,,,,,,,,,,,,,
1987072107,Monterey County,,,PEBBLE BEACH COMPANY PC-5783/OFFICE FACILITY,NEG,7/20/1987,,"TO CONSTRUCT A CONSOLIDATED OFFICE FACILITY TO HOUSE PEBBLE BEACH COMPANY EMPLOYEES, WHO ARE NOW WORKING AT PEBBLE BEACH LODGE AND CITY OF PACIFIC GROVE.",https://ceqanet.opr.ca.gov/1987072107,PEBBLE BEACH COMPANY PC-5783/OFFICE FACILITY,CATHY STEIN WEST,MONTEREY COUNTY,N/A,,,,,,,4084229018,,,Monterey,,LOPEZ-SUNRIDGE ROADS,,,008-041-09,68,,,No,7/21/1987,8/20/1987,Office,"Rezone, Use Permit","Aesthetics, Coastal Zone, Flood Plain/Flooding, Geology/Soils, Hydrology/Water Quality, Noise, Public Services, Sewer Capacity, Transportation, Wildfire",,,,,,,,,,,,,,,,,
1987072108,Marin County,,,PINESS FLOATING DOCK - TIDELANDS PERMIT/STRAWBERRY LAGOON,NEG,7/20/1987,,"CONSTRUCTION OF A PIER, GANGWAY, AND FLOATING DOCK ON STRAW- BERRY LAGOON.",https://ceqanet.opr.ca.gov/1987072108,PINESS FLOATING DOCK - TIDELANDS PERMIT/STRAWBERRY LAGOON,RICK BORGWARDT,MARIN COUNTY PLANNING DEPARTMENT,N/A,,,,,,,4154996269,,Mill Valley,Marin,,EAST STRAWBERRY DRIVE,,,43-293-08,101,RICHARDS,,No,7/21/1987,8/20/1987,Recreational,,"Aesthetics, Coastal Zone, Cultural Resources, Cumulative Effects, Flood Plain/Flooding, Geology/Soils, Land Use/Planning, Noise, Vegetation, Wetland/Riparian, Wildfire, Wildlife",,,,,,,,,,,,,,,,,
1987072109,Mendocino County,,,THOMPSON MINOR SUBDIVISION MS 28-87,NEG,7/20/1987,,MINOR SUBDIVISION CREATING 2 PARCELS OF 2.15 AND 2.51 ACRES EACH AND EXCEPTIONS TO LAND DIVISION REGULATIONS REGARDING FLAG LOT DIMENSIONS AND TO 40 FOOT,https://ceqanet.opr.ca.gov/1987072109,THOMPSON MINOR SUBDIVISION MS 28-87,GARY PEDRONI,MENDOCINO COUNTY PLANNING COMMISSION,N/A,,,,,,,7074634281,,,Mendocino,,LITTLE LAKE RD /CUMMINGS ST,,              5,119-050-46/47,1,,,No,7/21/1987,8/20/1987,Residential,"Land Division (Subdivision, etc.)","Coastal Zone, Cultural Resources, Flood Plain/Flooding, Geology/Soils, Hydrology/Water Quality, Septic System, Transportation, Vegetation, Wildfire",,,,,,,,,,,,,,,,,
1987072124,"Stockton, City of",City of Stockton,,HARBOR COVE PROJECT,NOP,7/20/1987,,"GENERAL PLAN AMENDMENT, PREZONING, ANNEXATION, AND SUBDIVISI ON OF APPROX 360 ACRES FOR DEVELOPMENT OF A PLANNED WATER OR IENTED RESIDENTIAL SUBDIVISION W/ FREEWAY AND BOUNDED BY BEAR CREEK ON THE NORTH AND MOSHER SLOUGH ON THE SOUTH AND WEST (HARBOR COVE PROJECT).",https://ceqanet.opr.ca.gov/1987072124,HARBOR COVE PROJECT,ASSOCIATE PLANNER,STOCKTON CITY,N/A,,,,,,,2099448266,,Stockton,San Joaquin,,HAMMER LANE/I-5/EIGHT-MILE ROAD,,            360,,I-5,BEAR CREE,,No,7/20/1987,8/19/1987,"Other, Residential","Annexation, General Plan Amendment, Land Division (Subdivision, etc.), Rezone, Use Permit","Aesthetics, Agriculture and Forestry Resources, Air Quality, Cultural Resources, Cumulative Effects, Economics/Jobs, Flood Plain/Flooding, Geology/Soils, Growth Inducement, Hazards & Hazardous Materials, Hydrology/Water Quality, Land Use/Planning, Noise, Public Services, Schools/Universities, Sewer Capacity, Solid Waste, Transportation, Vegetation, Wetland/Riparian, Wildlife",,,,,,,,,,,,,,,,,
1987072220,"Santa Barbara, City of",City of Santa Barbara,,FIESTA PARK,NOP,7/20/1987,,"AN APPROXIMATE 110,000 SQ FT DEVELOPMENT CONSISTING OF ONE, TWO, AND THREE STORY ELEMENTS. THE DEVELOPMENT WILL INCLUDE RESIDENTIAL UNITS, OFFICES, VISITO RESTAURANTS, AND RECREATIONAL FACILITIES.",https://ceqanet.opr.ca.gov/1987072220,FIESTA PARK,JANICE HUBBELL,SANTA BARBARA CITY,N/A,,,,,,,805-963-1663X57,,Santa Barbara,Santa Barbara,,325 W CABRILLO BLVD,,,,,,,No,7/24/1987,8/24/1987,"Commercial, Office, Recreational, Residential",,"Aesthetics, Air Quality, Cultural Resources, Flood Plain/Flooding, Geology/Soils, Noise, Transportation, Vegetation",,,,,,,,,,,,,,,,,
1987072634,State Water Resources Control Board,,,PETITION TO CHANGE PERMIT 18274A APP 24866A,NOE,7/20/1987,7/20/1987,APPROPRIAT WATER FROM NAPA RIVER TRIBUTARY TO SAN PABLO BAY,https://ceqanet.opr.ca.gov/1987072634,PETITION TO CHANGE PERMIT 18274A APP 24866A,ROSS SWENERTON,CA ST WRCB,N/A,,POB 2000,,SACRAMENTO,CA,95810,9163245639,,,Napa,,,,,,,,,,,,,,,,,Categorical Exemption,,,,,,,,,,,,,,
1987072635,Tehachapi Cummings Water District,,,ALTERNATION OF OLD GOLF SHOP,NOE,7/20/1987,7/20/1987,MINOR INTERIOR ALTERATION OF EXISTING OFFICE SPACE,https://ceqanet.opr.ca.gov/1987072635,ALTERNATION OF OLD GOLF SHOP,JACK GEARY,,N/A,,STAR ROUTE 3 BOX 4800,,TEHACHAPI,CA,93561,8058214428,,,Kern,,,,,,,,,,,,,,,,,Categorical Exemption,,,,,,,,,,,,,,
1987072902,Ventura County,,,CONDITIONAL USE PERMIT CUP-4501 (ADDENDUM 1 OF EIR FOR CUP),NOP,7/20/1987,,"LAND USE: AGRICULTURALLY RELATED, WITH PRIMARY RESIDENCE, 2 CARETAKER MOBILE HOMES, HORSE STABLE AND CORRALS, ORCHARDS AND OTHER COMMUNICATION FACILITIES EQUIPMENT.",https://ceqanet.opr.ca.gov/1987072902,CONDITIONAL USE PERMIT CUP-4501 (ADDENDUM 1 OF EIR FOR CUP),CARL MOREHOUSE,VENTURA COUNTY,N/A,,,,,,,8056542476,,,Ventura,,VENTU PARK ROAD,,,673-0-350-300,101,,,No,7/27/1987,8/26/1987,Other,Use Permit,"Aesthetics, Air Quality, Cumulative Effects, Flood Plain/Flooding, Geology/Soils, Transportation, Wildfire",,,,,,,,,,,,,,,,,
1987072921," Transportation, United States Department of",United States Department of Transportation,,LOS ANGELES METRO RAIL PROJECT,NOI,7/20/1987,,NOTICE OF INTENT FOR AN 18.6 SUBWAY ALIGNMENT FROM THE INTERSECTION OF WILSHIRE AND ROSSMORE TO FAIRFAX AND OAKWOOD.,https://ceqanet.opr.ca.gov/1987072921,LOS ANGELES METRO RAIL PROJECT,CARMEN C. CLARK,URBAN MASS TRANSIT ADMINISTRATION,N/A,,,,,,,4159747317,,Los Angeles,Los Angeles,,WILSHIRE BLVD/ALVARADO ST,,,,,,,No,7/29/1987,8/28/1987,Transportation,,"Aesthetics, Air Quality, Noise, Transportation",,,,,,,,,,,,,,,,,
