SCH Number,Lead Agency Name,Lead Agency Title,Lead Agency Acronym,Document Title,Document Type,Received,Posted,Document Description,Document Portal URL,Project Title,Contact Full Name,Contact Authority,Contact Job Title,Contact Email Address,Contact Address  1,Contact Address  2,Contact City,Contact State,Contact Zip Code,Contact Phone Number,Location Coordinates,Cities,Counties,County Clerks,Location Cross Streets,Location Zip Code,Location Total Acres,Location Parcel Number,Location State Highways,Location Waterways,Location Airports,NOC Has Non Late Comment,NOC State Review Start Date,NOC State Review End Date,NOC Development Type,NOC Local Action,NOC Project Issues,NOC Local Review Start Date,NOC Local Review End Date,NOE Exempt Status,NOE Exempt Citation,NOE Reasons for Exemption,NOD Agency,NOD Approved By Lead Agency,NOD Approved Date,NOD Significant Environmental Impact,NOD Environmental Impact Report Prepared,NOD Negative Declaration Prepared,NOD Other Document Type,NOD Mitigation Measures,NOD Mitigation Reporting Or Monitoring Plan,NOD Statement Of Overriding Considerations Adopted,NOD Findings Made Pursuant,NOD Final EIR Available Location
1984041814,"Caltrans, Planning","California Department of Transportation, Headquarters",,FREEWAY RAMP OVERCROSSING WIDENING,NOD,11/25/1986,11/25/1986,REPLACE OVER-CROSS/RECONSTRUCT PORTIONS OF INTERCHANGE,https://ceqanet.opr.ca.gov/1984041814/4,FREEWAY RAMP OVERCROSSING WIDENING,BARBARA BAXTER,CALTRANS DIST 11,N/A,,202 C STREET,,SAN DIEGO,CA,92101,,,San Diego,San Diego,,,,,,I-5,,,,,,,,,,,,,,,,,No,No,Yes,,Yes,,,,
1984121211,Los Angeles County,,,"LOS ANGELES COUNTY TENT. TRACT 34466, ZONE CHANGE 84-066",EIR,11/25/1986,,DEVELOPMENT OF 335 CONDOMINIUMS AND 565 SINGLE FAMILY HOMES ON A 257.6 ACRE SITE NEAR CANYON COUNTRY IN LOS ANGELES COUNTY.,https://ceqanet.opr.ca.gov/1984121211/2,"LOS ANGELES COUNTY TENT. TRACT 34466, ZONE CHANGE 84-066",KERWIN CHIH,LOS ANGELES COUNTY DEPARTMENT OF REGIONAL PLANNING,N/A,,,,,,,2139746461,,,Los Angeles,,ANTELOPE VALLEY FWY/SAN CANYON RD,,            258,,,,,No,11/25/1986,1/9/1987,Residential,"Community Plan, General Plan Amendment, Land Division (Subdivision, etc.), Rezone, Use Permit","Aesthetics, Air Quality, Cultural Resources, Cumulative Effects, Flood Plain/Flooding, Geology/Soils, Growth Inducement, Hydrology/Water Quality, Noise, Public Services, Schools/Universities, Sewer Capacity, Transportation, Vegetation, Wetland/Riparian, Wildfire, Wildlife",,,,,,,,,,,,,,,,,
1985062617,Los Angeles County,,,"LOS ANGELES COUNTY ZONE CHANGE 85-004, TENT. TRACT 43896",EIR,11/25/1986,,PROPOSED DEVELOPMENT OF 337 SINGLE FAMILY UNITS ON A 258 ACRES SITE NEAR VALENCIA IN LOS ANGELES COUNTY.,https://ceqanet.opr.ca.gov/1985062617/2,"LOS ANGELES COUNTY ZONE CHANGE 85-004, TENT. TRACT 43896",KERWIN CHIH,LOS ANGELES COUNTY DEPARTMENT OF REGIONAL PLANNING,N/A,,,,,,,2139746461,,,Los Angeles,,PICO CANYON RD/I-5,,            258,,,,,No,11/25/1986,1/9/1987,Residential,"Land Division (Subdivision, etc.), Rezone, Use Permit","Cumulative Effects, Flood Plain/Flooding, Geology/Soils, Growth Inducement, Public Services, Schools/Universities, Transportation, Vegetation, Wetland/Riparian, Wildfire, Wildlife",,,,,,,,,,,,,,,,,
1986050603,Santa Cruz County,,,REGIONAL TRANSPORTATION PLAN UPDATE EIR / SANTA CRUZ CO,EIR,11/25/1986,,UPDATE AND AMEND 1984 SANTA CRUZ COUNTY REGIONAL TRANSPORTA TION PLAN.,https://ceqanet.opr.ca.gov/1986050603,REGIONAL TRANSPORTATION PLAN UPDATE EIR / SANTA CRUZ CO,LINDA WILSHUSEN,SANTA CRUZ COUNTY   TRANSPORTATION COMMISSION,N/A,,,,,,,4084252776,,,Santa Cruz,,,,,,,,,No,11/25/1986,1/9/1987,,,"Aesthetics, Air Quality, Cultural Resources, Economics/Jobs, Flood Plain/Flooding, Geology/Soils, Growth Inducement, Noise, Public Services, Social, Transportation, Vegetation, Wetland/Riparian, Wildfire, Wildlife",,,,,,,,,,,,,,,,,
1986070104,"Morgan Hill, City of",City of Morgan Hill,,COCHRANE/WILTRON SHOPPING CENTER IN MORGAN HILL BUSINESS PK,EIR,11/25/1986,,"CONSTRUCTION OF 270,700 SQ FT RETAIL SHOPPING ON A 23.77-AC SITE WITHIN THE MORGAN HILL BUSINESS PARK AT THE SOUTHWEST QUADRANT OF THE INTERSECTION OF CO SUBSEQUENT EIR TO BE PREPARED TO ADDRESS CHANGES SINCE THE EIR WAS PREPARED FOR MORGAN HILL BUSINESS PARK (SCH NUMBER 79122502).",https://ceqanet.opr.ca.gov/1986070104,COCHRANE/WILTRON SHOPPING CENTER IN MORGAN HILL BUSINESS PK,DAVID BISCHOFF,MORGAN HILL CITY PLANNING DEPT,N/A,,,,,,,4087797248,,Morgan Hill,Santa Clara,,COCHRANE RD & HWY 101,,             24,727-12-63/64,101,,,No,11/25/1986,12/24/1986,Commercial,"Rezone, Specific Plan, Use Permit","Aesthetics, Public Services, Sewer Capacity, Transportation",,,,,,,,,,,,,,,,,
1986092208,"Motor Vehicles, Department of",California Department of Motor Vehicles,DMV,RANCHO CUCAMONGA DMV REGIONAL FIELD OFFICE,NOD,11/25/1986,11/25/1986,"PURCHASE OF 144,500 SQ' LT/CONST 1 STRY OFFICE",https://ceqanet.opr.ca.gov/1986092208/2,RANCHO CUCAMONGA DMV REGIONAL FIELD OFFICE,ROBERT A. SLEPPY,CA ST DEPT MOTOR VEHICLES,N/A,,2415 FIRST AVENUE,,SACRAMENTO,CA,95818,9163240214,,Rancho Cucamonga,San Bernardino,,,,,,,,,,,,,,,,,,,,,,,No,No,Yes,,Yes,,,,
1986092301,"Forestry and Fire Protection, Department of",California Department of Forestry and Fire Protection,CAL FIRE,"MT PIERCE REPEATER, TOWER & RADIO VAULT REPLACEMENT/HUMBOLDT",NOD,11/25/1986,11/25/1986,"REMOVAL OF ANTENNA STRUCTURE W/GUYS, RADIO BLDG, GEN HOUSE",https://ceqanet.opr.ca.gov/1986092301/2,"MT PIERCE REPEATER, TOWER & RADIO VAULT REPLACEMENT/HUMBOLDT",RAYMOND A. TATIAN,CA ST DEPT FORESTRY,N/A,,PO BOX 944246,,SACRAMENTO,CA,94244,9163241639,,,Humboldt,,,,,,,,,,,,,,,,,,,,,,,No,No,Yes,,,,,,
1986100616,"Lamont, City of",City of Lamont,,EXTENSION OF SEWER COLLECTION SYSTEM,NEG,11/25/1986,,CONTRUCTION OF AN INTERCEPTOR SEWER INE FROM THE WESTERN PORTION OF LAMONT NORTHERLY AND EASTERLY TO THE INTERSECTION OF WEEDPATCH HIGHWAY,https://ceqanet.opr.ca.gov/1986100616,EXTENSION OF SEWER COLLECTION SYSTEM,RAUL GALLO,LAMONT PUBLIC UTILITY DISTRICT,N/A,,,,,,,8058451212,,Lamont,Kern,,,,,,,,,No,11/25/1986,12/24/1986,"Other, Waste Treatment",,,,,,,,,,,,,,,,,,,
1986102022,"Youth Authority, Department of",Department of Youth Authority,,PRESTON PRE-CAMP EXPANSION,NOD,11/25/1986,11/25/1986,"EXPAND SCHOOL TO 5 BILDG, 100 BED ADDITION",https://ceqanet.opr.ca.gov/1986102022/2,PRESTON PRE-CAMP EXPANSION,RANDALL J. NELSON,CA ST YOUTH AUTHORITY,N/A,,"4241 WILLIAMSBOURGH, #17",,SACRAMENTO,CA,95823,9163240211,,Ione,Amador,,,,,,104,,,,,,,,,,,,,,,,,No,No,Yes,,Yes,,,,
1986102802,Healdsburg Unified School District,,,K-6 ELEMENTARY SCHOOL SITE AT 15708 HEALDSBURG AVE,NOD,11/25/1986,11/25/1986,ELEMENTARY SCHOOL,https://ceqanet.opr.ca.gov/1986102802/2,K-6 ELEMENTARY SCHOOL SITE AT 15708 HEALDSBURG AVE,JEROME D. SCHROEDER,HEALDSBURG UNION SCHOOL DISTRICT,N/A,,925 UNIVERSITY ST,,HEALDSBURG,CA,95448,7074313400,,Healdsburg,Sonoma,,,,,091-050-04,101,,,,,,,,,,,,,,,,,No,No,Yes,,,,,,
1986112503,San Ramon Valley Unified School District,,,CHARLOTTE WOOD INTERMEDIATE SCHOOL REPLACEMENT / DANVILLE,NEG,11/25/1986,,THE SCHOOL FOR 875 STUDENTS WILL OCCUPY A 15.01 ACRE VACANT SITE LOCATED IN A FULLY DEVELOPED SINGLE FAMILY RESIDENTIAL COMMUNITY. THE SITE WAS PURCHASED 1972 AND THE INTENDED PURPOSE SINCE THEN HAS BEEN THE LOCAT- ION OF AN INTERMEDIATE SCHOOL TO REPLACE THE EXISTING SCHOOL IN DOWNTOWN DANVILLE,https://ceqanet.opr.ca.gov/1986112503,CHARLOTTE WOOD INTERMEDIATE SCHOOL REPLACEMENT / DANVILLE,VERN WEBER,SAN RAMON VALLEY UNIFIED SCHOOL DISTRICT,N/A,,,,,,,4158371511,,Danville,Contra Costa,,,,             15,207-081/008,I-680,,,No,11/25/1986,12/16/1986,Educational,,"Aesthetics, Noise, Transportation, Vegetation",,,,,,,,,,,,,,,,,
1986112504,San Ramon Valley Unified School District,,,CALIFORNIA HIGH SCHOOL ADDITIONS/9870 BROADMOOR DRIVE,NEG,11/25/1986,,"DECLARATION FOR PROPOSED ADDITIONS TO THE EXISTING CALIFOR- NIA HIGH SCHOOL. THE SCHOOL HAS ABOUT 145,000 SQ' OF BUILD- INGS ON A 40.0 ACRE SITE FOR 1,800 67,925 SQ' OF SPACE WILL INCREASE THE ENROLLMENT CAPACITY TO 2,400 STUDENTS.",https://ceqanet.opr.ca.gov/1986112504,CALIFORNIA HIGH SCHOOL ADDITIONS/9870 BROADMOOR DRIVE,VERN WEBER,SAN RAMON VALLEY UNIFIED SCHOOL DISTRICT,N/A,,,,,,,4158371511,,San Ramon,Contra Costa,,,,,,I-680,,,No,11/25/1986,12/16/1986,Educational,,"Noise, Transportation",,,,,,,,,,,,,,,,,
1986112505,"Caltrans, Planning","California Department of Transportation, Headquarters",,MERRYDALE RD OVERCROSSING/FREITAS PRKWY NORTHBOUND ONRAMP,NEG,11/25/1986,,CONSTRUCT OVERCROSSING AT MERRYDALE RD OVER STATE ROUTE 101 AND ADD DIRECT NORTHBOUND ON-RAMP TO RTE 101 FROM THE FRONT- AGE ROAD AT THE FREITAS PARKWAY IN SITE IS ABOUT 0.2 MILE SOUTH OF THE FREITAS PARKWAY OVER- CROSSING AND INTERCHANGE,https://ceqanet.opr.ca.gov/1986112505,MERRYDALE RD OVERCROSSING/FREITAS PRKWY NORTHBOUND ONRAMP,PAUL H. HUGHES,CA ST DEPT TRANSPORTATION (CALTRANS),N/A,,,,,,,4155571318,,San Rafael,Marin,,,,,,101,LAS GALLINAS CREEK,SMITH RANCH,No,11/25/1986,12/24/1986,Transportation,,"Aesthetics, Air Quality, Cultural Resources, Flood Plain/Flooding, Geology/Soils, Growth Inducement, Noise, Transportation, Vegetation, Wetland/Riparian, Wildlife",,,,,,,,,,,,,,,,,
1986112518,"Menlo Park, City of",City of Menlo Park,,BOHANNON INDUSTRIAL PARK SUPPLEMENTAL EIR,EIR,11/25/1986,,BUILDOUT FOR BOHANNON INDUSTRIAL PARK LOCATED NEAR MARSH ROAD AND 101 FREEWAY.,https://ceqanet.opr.ca.gov/1986112518,BOHANNON INDUSTRIAL PARK SUPPLEMENTAL EIR,AL MORALES,MENLO PARK CITY,N/A,,,,,,,4158583400,,Menlo Park,San Mateo,,,,            212,,101,SAN FRANCISCO BAY,,No,11/26/1986,1/9/1987,Industrial,,"Aesthetics, Air Quality, Cumulative Effects, Economics/Jobs, Flood Plain/Flooding, Geology/Soils, Hazards & Hazardous Materials, Public Services, Transportation",,,,,,,,,,,,,,,,,
1986112519,"Parks and Recreation, Department of",California Department of Parks and Recreation,,"ASILOMAR COGENERATION PROJECT/PACIFIC GROVE, MONTEREY CO",EIR,11/25/1986,,"CONSTRUCT AND OPERATE A COGENERATION FACILITY AT ASILOMAR CONFERENCE GROUNDS, ASILOMAR BOULEVARD AND SINEX AVENUE",https://ceqanet.opr.ca.gov/1986112519,"ASILOMAR COGENERATION PROJECT/PACIFIC GROVE, MONTEREY CO",JAMES M. DOYLE,CA ST DEPARTMENT OF PARKS & RECREATION,N/A,,,,,,,9163246421,,Pacific Grove,Monterey,,,,,,68,,,No,11/26/1986,1/9/1987,,Specific Plan,"Air Quality, Cultural Resources, Cumulative Effects",,,,,,,,,,,,,,,,,
1986112604,"Los Angeles, City of",City of Los Angeles,,GP/ZONING CONSISTENCY PROGRAM - BOYLE HEIGHTS,EIR,11/25/1986,,RECIRCULATION OF A FINAL EIR AS THE DRAFT EIR FOR THE BOYLE HEIGHTS COMMUNITY PORTION OF THE CITY OF LOS ANGELES' GENERAL PLAN/ZONING CONSISTENCY PR,https://ceqanet.opr.ca.gov/1986112604,GP/ZONING CONSISTENCY PROGRAM - BOYLE HEIGHTS,JAMES D. ANGUIANO,LOS ANGELES CITY PLANNING DEPT,N/A,,,,,,,2134855714,,Los Angeles,Los Angeles,,,,,,"I-5,I-10",,,No,11/25/1986,12/24/1986,Other,,"Air Quality, Economics/Jobs, Geology/Soils, Public Services, Solid Waste, Transportation, Vegetation, Wildlife",,,,,,,,,,,,,,,,,
1986112605,Moorpark Unified School District,,,MOORPARK NEW ELEMENTARY SCHOOL,NEG,11/25/1986,,"AN ELEMENTARY SCHOOL PROJECT IN THE GRIFFIN DEVELOPMENT TRACT IN MOORPARK, DESIGNED INITIALLY AS A FULLY RELOCATABLE FACILITY WITH PERMANEN CONSTRUCTION WITHIN A PERIOD OF ONE YEAR FROM TIME OF OCCUPANCY. TOTAL CAPACITY WILL BE 650.",https://ceqanet.opr.ca.gov/1986112605,MOORPARK NEW ELEMENTARY SCHOOL,THOMAS DUFFY,MOORPARK UNIFIED SCHOOL DISTRICT,N/A,,,,,,,8055291149,,Moorpark,Ventura,,CAMPUS PARK DR/HERRON ST,,,,,,,No,11/25/1986,12/5/1986,Educational,,,,,,,,,,,,,,,,,,,
1986112609,"Irvine, City of",City of Irvine,,IRVINE GPA AND ZONE CHANGE FOR VILLAGE 12,NOP,11/25/1986,,GENERAL PLAN AMENDMENT AND ZONE CHANGE TO CHANGE THE LAND USE DESIGNATION FROM AGRICULTURAL TO ONE OF THREE PROPOSED ALTERNATIVES. THE GPA AND ZONE CHA EXPANSION OF THE EXISTING FACILITIES. INSTITUTIONAL. THE REMAINING 23 ACRES WILL RETAIN THE EXCLUSIVE AGRICULTURAL DESIGNATION,https://ceqanet.opr.ca.gov/1986112609,IRVINE GPA AND ZONE CHANGE FOR VILLAGE 12,MACIE CLEARY,IRVINE CITY,N/A,,,,,,,7146606110,,Irvine,Orange,,,,             75,,I-5,,MCAS EL TORO,No,11/25/1986,12/24/1986,"Industrial, Other","General Plan Amendment, Rezone","Agriculture and Forestry Resources, Air Quality, Land Use/Planning, Noise, Transportation, Vegetation, Wildlife",,,,,,,,,,,,,,,,,
1986113071,"Parks and Recreation, Department of",California Department of Parks and Recreation,,ACQUISITION OF LAND,NOE,11/25/1986,11/25/1986,ACQUIRE 1 INHOLDING PARCEL (12.04 ACS),https://ceqanet.opr.ca.gov/1986113071,ACQUISITION OF LAND,JAMES M. DOYLE,CA ST PARKS,N/A,,PO BOX 2390,,SACRAMENTO,CA,95811,9163246421,,,Santa Cruz,,,,,,,,,,,,,,,,,Categorical Exemption,,,,,,,,,,,,,,
1986113072,"Parks and Recreation, Department of",California Department of Parks and Recreation,,UTILITY EASEMENT,NOE,11/25/1986,11/25/1986,GRANT EASEMENT FOR FIRE SERVICE TO LOS ANGELES CITY,https://ceqanet.opr.ca.gov/1986113072,UTILITY EASEMENT,JAMES M. DOYLE,,N/A,,PO BOX 2390,,SACRAMENTO,CA,95811,9163246421,,Los Angeles,Los Angeles,,,,,,,,,,,,,,,,,Categorical Exemption,,,,,,,,,,,,,,
1986113073,"Parks and Recreation, Department of",California Department of Parks and Recreation,,AMEND ACCESS ROAD EASEMENT,NOE,11/25/1986,11/25/1986,MODIFY ALIGNMENT OF ACCESS RD TO PEACOCK GAP WATER TANK,https://ceqanet.opr.ca.gov/1986113073,AMEND ACCESS ROAD EASEMENT,JAMES M. DOYLE,CA ST PARKS,N/A,,PO BOX 2390,,SACRAMENTO,CA,95811,9163246421,,,Marin,,,,,,,,,,,,,,,,,Categorical Exemption,,,,,,,,,,,,,,
1986113074,"Forestry and Fire Protection, Department of",California Department of Forestry and Fire Protection,CAL FIRE,CALANDRA LOOKOUT (WILLIAMS HILL)/RADIO VALUT SITE LEASE RNWL,NOE,11/25/1986,11/25/1986,RENEWAL OF RADIO VAULT SITE LEASE,https://ceqanet.opr.ca.gov/1986113074,CALANDRA LOOKOUT (WILLIAMS HILL)/RADIO VALUT SITE LEASE RNWL,RAYMOND A. TATIAN,CA ST FOREST,N/A,,PO BOX 944246,,SACRAMENTO,CA,94244,9163241639,,,Monterey,,,,,,,,,,,,,,,,,Categorical Exemption,,,,,,,,,,,,,,
1986113075,"Forestry and Fire Protection, Department of",California Department of Forestry and Fire Protection,CAL FIRE,GORDON VALLEY FOREST FIRE STATION/DEPARTMENT LEASE,NOE,11/25/1986,11/25/1986,LEASE RENEWAL,https://ceqanet.opr.ca.gov/1986113075,GORDON VALLEY FOREST FIRE STATION/DEPARTMENT LEASE,RAYMOND A. TATIAN,CA ST FOREST,N/A,,PO BOX 944246,,SACRAMENTO,CA,94244,9163241639,,,Napa,,,,,,,,,,,,,,,,,Categorical Exemption,,,,,,,,,,,,,,
1986113076,Colusa County,,,"EIR 86-150/TERHEL FARMS, INC.",NOD,11/25/1986,11/25/1986,TENTATIVE PARCEL MAP 86-10-12,https://ceqanet.opr.ca.gov/1986113076,"EIR 86-150/TERHEL FARMS, INC.",GERALD W. ROSE,COLUSA CO PL,N/A,,1217 MARKET ST,,COLUSA,CA,95932,,,,Colusa,,,,,,,,,,,,,,,,,,,,,,,No,No,Yes,,Yes,,,,
1986113077,Colusa County,,,EIR 86-149/COASTAL OIL & GAS CORPORATION,NOD,11/25/1986,11/25/1986,DRILLING & OPERATING A GAS WELL,https://ceqanet.opr.ca.gov/1986113077,EIR 86-149/COASTAL OIL & GAS CORPORATION,GERALD W. ROSE,COLUSA CO PL,N/A,,1217 MARKET ST,,COLUSA,CA,95932,,,,Colusa,,,,,,,,,,,,,,,,,,,,,,,No,No,Yes,,Yes,,,,
1986113078,Colusa County,,,EIR 86-148/CGG LAND SEISMIC,NOD,11/25/1986,11/25/1986,CONDUCTING GEOPHYSICAL EXPLORATION,https://ceqanet.opr.ca.gov/1986113078,EIR 86-148/CGG LAND SEISMIC,GERALD W. ROSE,,N/A,,1217 MARKET ST,,COLUSA,CA,95932,,,,Colusa,,,,,,,,,,,,,,,,,,,,,,,No,No,Yes,,Yes,,,,
1986113079,Colusa County,,,EIR 86-147/KALCO DEVELOPMENT CORPORATION,NOD,11/25/1986,11/25/1986,DRILLING AND OPERATING A GAS WELL,https://ceqanet.opr.ca.gov/1986113079,EIR 86-147/KALCO DEVELOPMENT CORPORATION,GERALD W. ROSE,COLUSA CO PL,N/A,,1217 MARKET ST,,COLUSA,CA,95932,,,,Colusa,,,,,,,,,,,,,,,,,,,,,,,No,No,Yes,,Yes,,,,
1986113080,Colusa County,,,EIR 86-141/TXO PRODUCTION CORP,NOD,11/25/1986,11/25/1986,DRILLING AND OPERATING A GAS WELL,https://ceqanet.opr.ca.gov/1986113080,EIR 86-141/TXO PRODUCTION CORP,GERALD W. ROSE,COLUSA CO PL,N/A,,1217 MARKET ST,,COLUSA,CA,95932,,,,Colusa,,,,,,,,,,,,,,,,,,,,,,,No,No,Yes,,Yes,,,,
1986113081,"Santa Clara, City of",City of Santa Clara,,ZONE CHANGE/VARIANCE-DON SOUKUP,NOD,11/25/1986,11/25/1986,ZONE CHANGE TO REDESIGN STRUCTURE,https://ceqanet.opr.ca.gov/1986113081,ZONE CHANGE/VARIANCE-DON SOUKUP,GEOFFREY GOODFELLOW,,N/A,,1500 WARBURTON AVENUE,,SANTA CLARA,CA,95050,4089843111,,Santa Clara,,,,,,,,,,,,,,,,,,,,,,,,No,No,Yes,,Yes,,,,
