SCH Number,Lead Agency Name,Lead Agency Title,Lead Agency Acronym,Document Title,Document Type,Received,Posted,Document Description,Document Portal URL,Project Title,Contact Full Name,Contact Authority,Contact Job Title,Contact Email Address,Contact Address  1,Contact Address  2,Contact City,Contact State,Contact Zip Code,Contact Phone Number,Location Coordinates,Cities,Counties,County Clerks,Location Cross Streets,Location Zip Code,Location Total Acres,Location Parcel Number,Location State Highways,Location Waterways,Location Airports,NOC Has Non Late Comment,NOC State Review Start Date,NOC State Review End Date,NOC Development Type,NOC Local Action,NOC Project Issues,NOC Local Review Start Date,NOC Local Review End Date,NOE Exempt Status,NOE Exempt Citation,NOE Reasons for Exemption,NOD Agency,NOD Approved By Lead Agency,NOD Approved Date,NOD Significant Environmental Impact,NOD Environmental Impact Report Prepared,NOD Negative Declaration Prepared,NOD Other Document Type,NOD Mitigation Measures,NOD Mitigation Reporting Or Monitoring Plan,NOD Statement Of Overriding Considerations Adopted,NOD Findings Made Pursuant,NOD Final EIR Available Location
1983110911,Santa Barbara County Air Pollution Control District,,,CHEVRON PT. ARGUELLO/GAVIOTA PROJECT/GAVIOTA FIRE STATION,NOP,11/24/1986,,"AS A CONDITION OF APPROVAL FOR THEIR GAVIOTA OIL AND GAS PROCESSING FACILITY, CHEVRON IS REQUIRED TO FUND THE CONSTRUCTION AND EQUIPPING OF A FI GAVIOTA AREA. ROUTE); OIL AND GAS PROCESSING FACILITY AT GAVIOTA BPD WET OIL AND 120 MMSCFD GAS PRO",https://ceqanet.opr.ca.gov/1983110911/3,CHEVRON PT. ARGUELLO/GAVIOTA PROJECT/GAVIOTA FIRE STATION,BOBBIE BRATZ,SANTA BARBARA COUNTY APCD,N/A,,,,,,,8059618920,,,Santa Barbara,,,,              2,,101,,,No,11/25/1986,12/24/1986,"Industrial, Mining, Other, Water Facilities","General Plan Amendment, Rezone, Use Permit","Aesthetics, Air Quality, Coastal Zone, Cultural Resources, Cumulative Effects, Economics/Jobs, Flood Plain/Flooding, Geology/Soils, Growth Inducement, Hazards & Hazardous Materials, Hydrology/Water Quality, Land Use/Planning, Mineral Resources, Noise, Population/Housing, Public Services, Schools/Universities, Social, Solid Waste, Transportation, Vegetation, Wetland/Riparian, Wildfire, Wildlife",,,,,,,,,,,,,,,,,
1986072918,"Hayward, City of",City of Hayward,,CARLOS BEE BOULEVARD & HARDER ROAD PROJECT 8001,EIR,11/24/1986,,PROPOSED ALTERNATIVES FOR CARLOS BEE BLVD & HARDER RD EXTEN SION IN CITY OF HAYWARD. EIGHT SEPARATE ALTERNATIVES WILL BE ANALYZED FOR PROVIDING ROADWAY MISSION BLVD PAST HAYWARD STATE UNIVERSITY TO AREAS OF POTENTIAL RESIDENTIAL DEVELOPMENT IN WALPERT RIDGE AREA. JOINT PROJECTS BY CITY AND CALIF.,https://ceqanet.opr.ca.gov/1986072918,CARLOS BEE BOULEVARD & HARDER ROAD PROJECT 8001,DENNIS L. BUTLER,HAYWARD CITY PLANNING DEPT,N/A,,,,,,,415-581-2345X5289,,Hayward,Alameda,,,,,,238,,,No,11/24/1986,1/8/1987,"Transportation, Transportation",,"Aesthetics, Air Quality, Flood Plain/Flooding, Geology/Soils, Noise, Transportation, Wetland/Riparian, Wildlife",,,,,,,,,,,,,,,,,
1986092902,"Maricopa, City of",City of Maricopa,,OMEGA RESEOURCE RECOVER AND INCINERATION FACILITY,EIR,11/24/1986,,"ECYCLING CONTAMINATED OR USED ORGANIC CHEMICALS TO ORIGINAL PURITY SPECIFICATION BY A VARIETY OF PROVEN SEPARATION TECH NIQUES. OMEGA IS CONDUCTING THESE IN WHITTIER, AND NEEDS ADDITIONAL PRODUCTION CAPACITY TO T COMMERCIAL DEMAND. THERE IS NO ROOM FOR EXPANSION AT THE PRESENT SITE.",https://ceqanet.opr.ca.gov/1986092902,OMEGA RESEOURCE RECOVER AND INCINERATION FACILITY,GRAHAM EDDY,MARICOPA CITY,N/A,,,,,,,8053240290,,Maricopa,Fresno,,,,            150,,166/33,,,No,11/24/1986,1/8/1987,Other,,"Aesthetics, Air Quality, Growth Inducement, Noise, Public Services, Solid Waste",,,,,,,,,,,,,,,,,
1986101411,"San Mateo, City of",City of San Mateo,,OX MOUNTAIN RANCH LANDFILL /SAN FRANCISCO SOLID WASTE AMEND,EIR,11/24/1986,,"APPLICATION TO AMEND USE PERMIT/COASTAL DEVELOPMENT PERMIT TO ACCEPT AN ADDITIONAL 15 MILLION TONS OF WASTE FROM SAN FRANCISCO STARTING IN 1988 OR '93. RATE WOULD DOUBLE. THE SUPPLEMENTAL EIR WILL ADDRESS THE IMPACTS OF ACCEPTING ADDITIONAL REFUSE; TRAFFIC, ALTERNATE ACCESS ROUTES, AIR QUALITY, NOISE,",https://ceqanet.opr.ca.gov/1986101411,OX MOUNTAIN RANCH LANDFILL /SAN FRANCISCO SOLID WASTE AMEND,WILLIAM ROZAR,SAN MATEO COUNTY    PLANNING DEPT,N/A,,,,,,,4153634161,,Half Moon Bay,San Mateo,,HALF MOON BAY ROAD,,,,92,,,No,11/24/1986,1/8/1987,Other,Use Permit,"Air Quality, Coastal Zone, Cumulative Effects, Geology/Soils, Noise, Solid Waste, Transportation",,,,,,,,,,,,,,,,,
1986102024,Kern County,,,"CUP #7, ZONE VARIANE #6, MAP #203/CONTEL CELLULAR TOWER",NEG,11/24/1986,,TO ALLOW THE INSTALLATION OF A 285' HIGH COMMUNICATIONS TOW- ER AND CONSTRUCTION OF A 12X18' ELECTRONICS SHELTER. THE TOWER IS PART OF A COMMUNICATIONS VIDE CELLULAR PHONE SERVICE. A VARIANCE IS REQUIRED FOR THE TOWER IN ORDER TO EXCEED THE ALLOWED HEIGHT OF 80'.,https://ceqanet.opr.ca.gov/1986102024,"CUP #7, ZONE VARIANE #6, MAP #203/CONTEL CELLULAR TOWER",MAGGIE PRIMER,KERN COUNTY PLANNING & DEVELOPMENT SERVICES,N/A,,,,,,,8058612615,,,Kern,,I-5/SR 166,,              4,,I-5/SR 166,,,No,11/24/1986,12/24/1986,Other,Use Permit,"Aesthetics, Agriculture and Forestry Resources, Transportation",,,,,,,,,,,,,,,,,
1986110410,California State Lands Commission,,,SALVAGE OF "SAN AGUSTIN" /DRAKE'S BAY OFF MARIN COUNTY,NEG,11/24/1986,,"APPLICANT PROPOSES TO SEARCH FOR AND SALVAGE THE REMAINS OF THE SPANISH MANILLA GALLEON ""SAN AGUSTIN"", DRAKE'S BAY, OFFSHORE MARIN COUNTY.",https://ceqanet.opr.ca.gov/1986110410,SALVAGE OF "SAN AGUSTIN" /DRAKE'S BAY OFF MARIN COUNTY,GOODYEAR K. WALKER,CA STATE LANDS COMMISSION,N/A,,,,,,,,,,Marin,,,,,,,DRAKE'S BAY,,No,11/24/1986,12/24/1986,Other,,"Cultural Resources, Geology/Soils, Wildlife",,,,,,,,,,,,,,,,,
1986112401,Burton School District,,BSD,OAK GROVE SCHOOL - BURTON SCHOOL DISTRICT,NEG,11/24/1986,,ADDITION OF FIVE CLASSROOMS AND AN ADDITION OF A MULTI- PURPOSE BUILDING AT ALREADY EXISTING SITE.,https://ceqanet.opr.ca.gov/1986112401,OAK GROVE SCHOOL - BURTON SCHOOL DISTRICT,BILL BUCKLEY,BURTON SCHOOL DISTRICT,N/A,,,,,,,,,Porterville,Tulare,,,,,,,,,No,11/24/1986,12/5/1986,Educational,,,,,,,,,,,,,,,,,,,
1986112402,State Water Resources Control Board,,,APPLICATION 28035 TO APPROPRIATE WATER,NEG,11/24/1986,,"PROVIDE WATER FOR MINING PURPOSES AT THE GOLDEN TREASURE GROUP MINE CLAIM. THE APPLICANT PLANS TO PLACER MINE FOR GOLD, SILVER, AND CHROME USING SLU THIS PRELIMINARY MINING IS SUCCESSFUL, IT IS ANTICIPATED CONVERSION TO MECHANIZED MINING USING A WASHING PLANT.",https://ceqanet.opr.ca.gov/1986112402,APPLICATION 28035 TO APPROPRIATE WATER,HEIDI BRATOVICH,CA ST WATER RESOURCES CONTROL BOARD,N/A,,,,,,,9163245714,,,Placer,,,,,,,AMERICAN RIVER,,No,11/24/1986,12/24/1986,Mining,,,,,,,,,,,,,,,,,,,
1986112403,"Norco, City of",City of Norco,,THIRD STREET ALIGNMENT AND AREA PLAN - CITY OF NORCO,NOP,11/24/1986,,"THE PROJECT CONSISTS OF ABOUT 285 ACRES PROPOSED TO BE DEVE LOPED AS FOLLOWS: 140+/- ACRES OF LOW DENSITY (0-2) SINGLE FAMILY RESIDENTIAL, 145 ACRES OF C AN THE EXTENSION AND ALIGNMENT OF THIRD STREET TO THE WEST OF HAMNER AVENUE",https://ceqanet.opr.ca.gov/1986112403,THIRD STREET ALIGNMENT AND AREA PLAN - CITY OF NORCO,GENE W. YOUNG,NORCO CITY,N/A,,,,,,,7147353900,,Norco,Riverside,,,,            285,,,LAKE NORCONIAN,,No,11/24/1986,12/24/1986,Residential,,Aesthetics,,,,,,,,,,,,,,,,,
1986112404,Amador County,,,DEVIL'S NOSE (FERC #8759) CROSS COUNTRY WATERPOWER PROJECT,NOP,11/24/1986,,AMADOR COUNTY HAS PLANNED TO DEVELOP THE DEVIL'S NOSE AND CROSS COUNTY FERC PROJECTS FOR THE PURPOSES OF POWER AND GENERATION AND WATER STORAGE. THES ERED SEPARATELY BUT ARE NOW BEING CONSIDERED AS A SINGLE COM BINED DEVELOPMENT. PROJECT AREA UNDER  STUDY IS UPPER AND MID PORTIONS OF THE NORTH FORK MOK,https://ceqanet.opr.ca.gov/1986112404,DEVIL'S NOSE (FERC #8759) CROSS COUNTRY WATERPOWER PROJECT,GARY CLARK,AMADOR COUNTY PLANNING DEPARTMENT,N/A,,,,,,,2092236380,,,Amador,,,,,,,N. FORK/MOKELUMNE RV,,No,11/24/1986,12/24/1986,Power,,,,,,,,,,,,,,,,,,,
1986112405,San Bernardino County,,,LOS ANGELES BROTHERHOOD CRUSADE RETREAT CENTER,NOP,11/24/1986,,AMENDED SITE APPROVAL TO ESTABLISH A CONFERENCE AND RETREAT CENTER ON 5 ACRES IN THE CREST FOREST COMMUNITY PLAN AREA.,https://ceqanet.opr.ca.gov/1986112405,LOS ANGELES BROTHERHOOD CRUSADE RETREAT CENTER,INA PETOKAS,SAN BERNARDINO COUNTY,N/A,,,,,,,7143874146,,,San Bernardino,,,,              5,, 138, SEELEY CREEK,,No,11/24/1986,12/24/1986,Other,Use Permit,Noise,,,,,,,,,,,,,,,,,
1986112407,Riverside County,,,SPECIFIC PLAN 158-MENIFEE VILLAGE,NOP,11/24/1986,,"ATTEMPS TO OBTAIN COMMITMENTS FOR MEDICAL CAMPUS/HOSPITAL USES IN PLANNING AREA 2-6 HAVE NOT BEEN SUCCESSFUL, BUT BUILDER INTEREST IN MEDIUM LOW RES PROPOSALS ARE TO DELETE THE MED CAMPUS DESIGNATION; REDESIG NATE PLANNING AREA 2-6; REDESIGNATE PLANNING 2-5 AS MED LOW RESIDENTIAL.",https://ceqanet.opr.ca.gov/1986112407,SPECIFIC PLAN 158-MENIFEE VILLAGE,RON GOLDMAN,RIVERSIDE COUNTY PLANNING DEPARTMENT,N/A,,,,,,,7147876181,,,Riverside,,,,,,215,,,No,11/24/1986,12/24/1986,"Commercial, Residential",Rezone,,,,,,,,,,,,,,,,,,
1986112408,Mono County,,,MAMMOTH PACIFIC II & III GEOTHERMAL PROJECT,NOP,11/24/1986,,"TWO 10 MW BINARY CYCLE GEOTHERMAL ELECTRICAL GENERATING FACILITIES TO PRODUCE FOR SOUTHERN CA EDISON GY, INC AND UNDER GEOTHERMAL LEASE UNIT WILL OCCUPY ABOUT 2 ACRES AND WILL BE ADJACENT TO EACH OTHER. THE UNITS WIL BE SUPPLIED GEOTHERMAL RESOURCES FROM GEOTHERMAL PRODUCTION WELLS.",https://ceqanet.opr.ca.gov/1986112408,MAMMOTH PACIFIC II & III GEOTHERMAL PROJECT,DAN LYSTER,MONO COUNTY ENERGY DEPARTMENT,N/A,,,,,,,6199346704,,Mammoth Lakes,Mono,,US 395,,,,203,,MAMMOTH,No,11/24/1986,12/24/1986,"Other, Power",,"Aesthetics, Air Quality, Coastal Zone, Cultural Resources, Cumulative Effects, Geology/Soils, Growth Inducement, Hazards & Hazardous Materials, Hydrology/Water Quality, Mineral Resources, Noise, Public Services, Transportation, Vegetation, Wetland/Riparian, Wildfire, Wildlife",,,,,,,,,,,,,,,,,
1986112409,"Plymouth, City of",City of Plymouth,,SHENANDOAH MASTER PLAN AND DEVELOPMENT AGREEMENT/BURKE RANCH,NOP,11/24/1986,,"REVISION OF A PREVOUSLY APPROVED DEVELOPMENT AGREEMENT KNOWN AS THE BURKE RANCH DEVELOPMENT WHICH AFFECTS ABOUT 250 ACRES OF UNDEVELOPED LAND ANNEXED TO THE THE PROPOSED MASTER PLAN CALLS FOR THE PHASED DEVELOPMENT OF RESIDENTIAL, COMMERCIAL AND INDUSTRIAL SITES WITH NECESSARY INFRASTRUCTURE OVER A PERIOD OF AB",https://ceqanet.opr.ca.gov/1986112409,SHENANDOAH MASTER PLAN AND DEVELOPMENT AGREEMENT/BURKE RANCH,CHARLES F. FIELD,PLYMOUTH CITY,N/A,,,,,,,2095328768,,Plymouth,Amador,,,,            250,,,,,No,11/24/1986,12/24/1986,"Commercial, Industrial, Residential",Master Plan,,,,,,,,,,,,,,,,,,
1986112410,Madera County,,,"PACIFIC AGRICULTURAL SERVICES, INC. RESIDENTIAL DEVELOPMENT",NOP,11/24/1986,,"DEVELOP A RURAL RESIDENTIAL SUBDIVISION ON ABOUT 407 ACRES BOUNDED BY RD 206, THE MADERA CANAL, SUMNER HILL SUBDIVISION AND THE SAN JOAQUIN RIVER. THE PRO OF SEC 7 & 18, TOWNSHIP 11S, RANGE 20E AND SECTIONS 12,13,14 23 & 24, TOWNSHIP 11S, RANGE 20E, MDB&M.",https://ceqanet.opr.ca.gov/1986112410,"PACIFIC AGRICULTURAL SERVICES, INC. RESIDENTIAL DEVELOPMENT",OMID SHAKERI,MADERA COUNTY PLANNING DEPARTMENT,N/A,,,,,,,2096757821,,Madera,Madera,,AVE 14 1/2 & HWY 41,,            407,51-200-06,41,,,No,11/24/1986,12/24/1986,Residential,"Land Division (Subdivision, etc.)","Aesthetics, Agriculture and Forestry Resources, Cultural Resources, Flood Plain/Flooding, Geology/Soils, Growth Inducement, Hydrology/Water Quality, Land Use/Planning, Noise, Public Services, Schools/Universities, Sewer Capacity, Transportation, Vegetation, Wetland/Riparian, Wildlife",,,,,,,,,,,,,,,,,
1986112411,Tulare County,,,CASE #GPA 86-10/DAVID WEAVER GPA,CON,11/24/1986,,"THE TULARE COUNTY BUILDING AND PLANNING DEPARTMENT HAS RECEV VED AND ACCEPTED AS COMPLETE, AN APPLICATION FOR A GENERAL PLAN AMENDMENT TO THE THREE RIVERS ALLOW MOBILEHOMES PARKS IN THE HIGH DENSITY AND MULTIFAMILY RESIDENTIAL AREAS.",https://ceqanet.opr.ca.gov/1986112411,CASE #GPA 86-10/DAVID WEAVER GPA,JERRY T. BEATTY,TULARE COUNTY PLANNING DEPARTMENT,N/A,,,,,,,,,,Tulare,,,,             16,,198,KAWEAH RIVER,,No,11/24/1986,12/24/1986,Residential,General Plan Amendment,,,,,,,,,,,,,,,,,,
1986112412,Placer County,,,SQUAW VALLEY SKI RESORT,NOP,11/24/1986,,"REZONING, GPA, CUP, MODIFICATIONS ASSOCIATED WITH SKI LIFT AT SHIRLEY CANYON IN SQUAW VALLEY. OFR THE SKI LIFT KNOWN AS THE SQUA THE REMOVAL OF ABOUT 2,000 TREES OF 6"" DIAMETER OR LARGER, TO OPEN UP ADDITIONAL SKI TRAILS.",https://ceqanet.opr.ca.gov/1986112412,SQUAW VALLEY SKI RESORT,BILL COMBS,PLACER COUNTY PLANNING,N/A,,,,,,,9168234721,,,Placer,,,,            300,,,,,No,11/24/1986,12/24/1986,Recreational,"General Plan Amendment, Rezone, Use Permit","Aesthetics, Air Quality, Cultural Resources, Economics/Jobs, Flood Plain/Flooding, Hydrology/Water Quality, Solid Waste, Vegetation, Wildlife",,,,,,,,,,,,,,,,,
1986112413,San Bernardino County,,,MANURE COMPOSTING FACILITY - CITY OF CHINO,NOP,11/24/1986,,SITE APPROVAL TO ESTABLISH A MANURE COMPOSTING FACILITY ON 97.36 ACRES. PROPOSAL TO DEVELOP A FACILITY TO CONVERT DAIRY WASTE AND DIGESTED SEWAGE INTO FER AGRICULTURE AND HORTICULTURE INDUSTRIES. WASTES TO COME FROM LOCAL CHINO DAIRIES WITHIN THE AREA.,https://ceqanet.opr.ca.gov/1986112413,MANURE COMPOSTING FACILITY - CITY OF CHINO,MARILYN BEARDSLEE,SAN BERNARDINO COUNTY,N/A,,,,,,,7143874112,,Chino,San Bernardino,,,,             97,,,,,No,11/24/1986,12/24/1986,,,,,,,,,,,,,,,,,,,,
1986112414,Riverside County,,,MURRIETA HOT SPRINGS SPECIFIC PLAN,NOP,11/24/1986,,APPLICANTS PROPOSE A PLAN AMENDMENT FOR THE 177.97 ACRE POR TION OF PHASE III OF THE MUREITTA HOT SPRINGS SPECIFIC PLAN ORIGNIALLY PREPARED AND ADOPTED IN A COMMUNITY PLANNING PROJECT SENSITIVE TO THE CURRENT MARKET,https://ceqanet.opr.ca.gov/1986112414,MURRIETA HOT SPRINGS SPECIFIC PLAN,RON GOLDMAN,RIVERSIDE COUNTY PLANNIG,N/A,,,,,,,787-6181,,,Riverside,,,,            178,,215/79,,,No,11/24/1986,12/24/1986,,,,,,,,,,,,,,,,,,,,
1986112502,"Redding, City of",City of Redding,,"UP 71-86/REPLACE HELIPORT, MERCY MED CENTER/CLAIRMONT HTS",NEG,11/24/1986,,"REPLACEMENT OF EXISTING HELIPORT WITH NEW HELIPORT ABOUT 600 FEET TO THE WEST OF EXISTING FACILITY AT MERCEY MEDICAL CENTER, CLAIRMONT HEIGHTS.",https://ceqanet.opr.ca.gov/1986112502,"UP 71-86/REPLACE HELIPORT, MERCY MED CENTER/CLAIRMONT HTS",LARRY MORGON,REDDING CITY        PLANNING DEPT,N/A,,,,,,,9162254020,,Redding,Shasta,,"ROSALINE AVENUE, EDITH AVENUE",,,104-410-44,273,,BENTON,No,11/25/1986,12/17/1986,Transportation,Use Permit,"Geology/Soils, Noise",,,,,,,,,,,,,,,,,
1986112603,"Santa Monica, City of",City of Santa Monica,,"WESTSIDE HOSTEL PROJECT, SANTA MONICA",NEG,11/24/1986,,"CONSTRUCTION OF A FOUR STORY, 200 BED YOUTH HOSTEL WITH ASSOCIATED OFFICES AND A RETAIL TRAVEL STORE. THE PROJECT WILL INCORPORATE AND INCLUDE THE R REHABILITATION OF THE RAPP SALOON, A DESIGNATED CITY LANDMARK. TOTAL SQUARE FOOTAGE OF THE PROJECT IS 27,272.",https://ceqanet.opr.ca.gov/1986112603,"WESTSIDE HOSTEL PROJECT, SANTA MONICA",KAREN ROSENBERG,SANTA MONICA CITY,N/A,,,,,,,2134588341,,Santa Monica,Los Angeles,,,,,,I-10,,SANTA MONICA,No,11/25/1986,12/24/1986,"Other, Residential",,"Aesthetics, Coastal Zone, Cultural Resources, Hydrology/Water Quality, Noise, Sewer Capacity, Transportation",,,,,,,,,,,,,,,,,
1986112606,"San Diego, City of",City of San Diego,,CREEKVIEW SOUTH AND POMERADO EXTENSION SEWER,NOP,11/24/1986,,TENTATIVE MAP AND PLANNED RESIDENTIAL DEVELOPMENT PERMIT FOR 944 FAMILY RESIDENTIAL UNITS. ALSO A LAND DEVELOPMENT PERMIT FOR A TRUNK SEWER ALONG PEN,https://ceqanet.opr.ca.gov/1986112606,CREEKVIEW SOUTH AND POMERADO EXTENSION SEWER,ELLEN MOSLEY,SAN DIEGO CITY,N/A,,,,,,,6192366773,,San Diego,San Diego,,POWAY RD/I-15,,,,I-15,PENASQUITOS CREEK,,No,11/25/1986,12/24/1986,"Residential, Waste Treatment","Land Division (Subdivision, etc.), Rezone","Cultural Resources, Noise, Vegetation, Wetland/Riparian, Wildlife",,,,,,,,,,,,,,,,,
1986112607,"Chula Vista, City of",City of Chula Vista,,OTAY RIO BUSINESS PARK,NOP,11/24/1986,,"DIVISION OF 211 ACRES INTO 78 INDUSTRIAL LOTS, 49 SINGLE FAMILY DETACHED DWELLINGS, ONE COMMERCIAL LOT, AND OPEN SPACES.",https://ceqanet.opr.ca.gov/1986112607,OTAY RIO BUSINESS PARK,DOUGLAS REID,CHULA VISTA CITY,N/A,,,,,,,6196915101,,Chula Vista,San Diego,,OTAY VALLEY RD,,            210,,I-805,OTAY R,BROWN FIELD,No,11/25/1986,12/24/1986,"Commercial, Industrial, Residential","General Plan Amendment, Land Division (Subdivision, etc.), Rezone","Aesthetics, Air Quality, Cultural Resources, Cumulative Effects, Flood Plain/Flooding, Geology/Soils, Growth Inducement, Hazards & Hazardous Materials, Hydrology/Water Quality, Land Use/Planning, Mineral Resources, Noise, Public Services, Schools/Universities, Sewer Capacity, Transportation, Vegetation, Wetland/Riparian, Wildlife",,,,,,,,,,,,,,,,,
1986112608,Southern California Rapid Transit District,Southern Calif Rapid Transit District,,LOS ANGELES RAIL RAPID TRANSIT PROJECT (METRO RAIL),NOP,11/24/1986,,"THE SEGMENT OF THE METRO RAIL PROEJCT WHICH IS BEYOND MOS-1. IT CONSISTS OF REALIGNMENT OF THE SEGMENT TO AVOID TUNNELING THROUGH POTENTIAL RISK ZONES. THE SUBWAY OR AERIAL CONFIGURATION. THE TECHNOLOGY WILL BE THE SAME CONVENTIONAL, HIGH CAPACITY, HIGH SPEED RAIL RAPID TRAN SIT AS IN THE CURRENTLY ADOPTED PR",https://ceqanet.opr.ca.gov/1986112608,LOS ANGELES RAIL RAPID TRANSIT PROJECT (METRO RAIL),"NADEEM TAHIR, MANAGER",SOUTHERN CALIFORNIA RAPID TRANSIT DISTRICT,N/A,,,,,,,2139726439,,Los Angeles,Los Angeles,,,,,,,,,No,11/25/1986,12/24/1986,"Transportation, Transportation",Specific Plan,"Aesthetics, Air Quality, Coastal Zone, Cultural Resources, Cumulative Effects, Economics/Jobs, Flood Plain/Flooding, Geology/Soils, Growth Inducement, Hazards & Hazardous Materials, Land Use/Planning, Noise, Transportation, Wildlife",,,,,,,,,,,,,,,,,
1986113011,"Coastal Conservancy, California State",California State Coastal Conservancy,SCC,MUSSEL SHOALS (CHONETTE) ACCESS DONATION,NOE,11/24/1986,11/24/1986,ACCPTNC OF FEE TITLE TO SM LT FOR FUTURE TRANSFER/COASTAL,https://ceqanet.opr.ca.gov/1986113011,MUSSEL SHOALS (CHONETTE) ACCESS DONATION,GAIL ROSEN,CA ST COASTA,N/A,,"1330 BROADWAY, STE 1100",,OAKLAND,CA,94612,4154641015,,,Ventura,,,,,,,,,,,,,,,,,Categorical Exemption,,,,,,,,,,,,,,
1986113012,California State University Board of Trustees,California State University Board of Trustees,,EXTERIOR PAINTING,NOE,11/24/1986,11/24/1986,EXTERIOR PAINTING OF GYM BUILDING,https://ceqanet.opr.ca.gov/1986113012,EXTERIOR PAINTING,JON H. REGNIER,,N/A,,400 GOLDEN SHORE,,LONG BEACH,CA,90804,2134984131,,Long Beach,Los Angeles,,,,,,,,,,,,,,,,,Categorical Exemption,,,,,,,,,,,,,,
1986113013,California State University Board of Trustees,California State University Board of Trustees,,"REPLACE ELECTRICAL SUB-PANELS, PHASE III",NOE,11/24/1986,11/24/1986,REPLCMT OF 19 SUBPANELS IN PETERSON HALL,https://ceqanet.opr.ca.gov/1986113013,"REPLACE ELECTRICAL SUB-PANELS, PHASE III",JON H. REGNIER,,N/A,,400 GOLDEN SHORE,,LONG BEACH,CA,90804,2134984131,,Long Beach,Los Angeles,,,,,,,,,,,,,,,,,Categorical Exemption,,,,,,,,,,,,,,
1986113014,California State University Board of Trustees,California State University Board of Trustees,,REPLACE FLOOR TILE,NOE,11/24/1986,11/24/1986,REPLACE FLOOR TILE IN PETERSON HALL 1,https://ceqanet.opr.ca.gov/1986113014,REPLACE FLOOR TILE,JON H. REGNIER,,N/A,,400 GOLDEN SHORE,,LONG BEACH,CA,90804,2134984131,,Long Beach,Los Angeles,,,,,,,,,,,,,,,,,Categorical Exemption,,,,,,,,,,,,,,
1986113015,California State University Board of Trustees,California State University Board of Trustees,,REPAIR EXTERIOR STAIRS,NOE,11/24/1986,11/24/1986,REPLACE 2 SETS OF STAIRS ON NW CORNER OF PLAZA,https://ceqanet.opr.ca.gov/1986113015,REPAIR EXTERIOR STAIRS,JON H. REGNIER,,N/A,,400 GOLDEN SHORE,,LONG BEACH,CA,90804,2134984131,,Long Beach,Los Angeles,,,,,,,,,,,,,,,,,Categorical Exemption,,,,,,,,,,,,,,
1986113016,California State University Board of Trustees,California State University Board of Trustees,,REPLACE WATER MAIN VALVES,NOE,11/24/1986,11/24/1986,REPLACE 9 GATE VALVES ON MAIN WATER LINE,https://ceqanet.opr.ca.gov/1986113016,REPLACE WATER MAIN VALVES,JON H. REGNIER,,N/A,,400 GOLDEN SHORE,,LONG BEACH,CA,90804,2134984131,,Long Beach,Los Angeles,,,,,,,,,,,,,,,,,Categorical Exemption,,,,,,,,,,,,,,
1986113017,California State University Board of Trustees,California State University Board of Trustees,,"REPLACE CEILING TILE/LIGHT FIXTURES, P.E.",NOE,11/24/1986,11/24/1986,REPLACE CEILING/LIGHT FIXTURES IN GYM,https://ceqanet.opr.ca.gov/1986113017,"REPLACE CEILING TILE/LIGHT FIXTURES, P.E.",JON H. REGNIER,,N/A,,400 GOLDEN SHORE,,LONG BEACH,CA,90804,2134984131,,Long Beach,Los Angeles,,,,,,,,,,,,,,,,,Categorical Exemption,,,,,,,,,,,,,,
1986113018,California State University Board of Trustees,California State University Board of Trustees,,REPLACE LIGHT FIXTURES,NOE,11/24/1986,11/24/1986,REPLACE OBSOLETE OVERHEAD LIGHT FIXTURES,https://ceqanet.opr.ca.gov/1986113018,REPLACE LIGHT FIXTURES,JON H. REGNIER,,N/A,,400 GOLDEN SHORE,,LONG BEACH,,90804,2134984131,,Long Beach,Los Angeles,,,,,,,,,,,,,,,,,Categorical Exemption,,,,,,,,,,,,,,
1986113019,California State University Board of Trustees,California State University Board of Trustees,,REPLACE UNDERGROUND HEATING LINES,NOE,11/24/1986,11/24/1986,REPLACE BURIED STEEL HEATING LINES,https://ceqanet.opr.ca.gov/1986113019,REPLACE UNDERGROUND HEATING LINES,JON H. REGNIER,,N/A,,400 GOLDEN SHORE,,LONG BEACH,,90804,2134984131,,Long Beach,Los Angeles,,,,,,,,,,,,,,,,,Categorical Exemption,,,,,,,,,,,,,,
1986113020,California State University Board of Trustees,California State University Board of Trustees,,EXTERIOR PAINTING,NOE,11/24/1986,11/24/1986,EXTERIOR PAINTING,https://ceqanet.opr.ca.gov/1986113020,EXTERIOR PAINTING,JON H. REGNIER,,N/A,,400 GOLDEN SHORE,,LONG BEACH,,90804,2134984131,,Long Beach,Los Angeles,,,,,,,,,,,,,,,,,Categorical Exemption,,,,,,,,,,,,,,
1986113021,California State University Board of Trustees,California State University Board of Trustees,,EXTERIOR PAINTING,NOE,11/24/1986,11/24/1986,EXTERIOR PAINTING,https://ceqanet.opr.ca.gov/1986113021,EXTERIOR PAINTING,JON H. REGNIER,,N/A,,400 GOLDEN SHORE,,LONG BEACH,,90804,2134984131,,Long Beach,Los Angeles,,,,,,,,,,,,,,,,,Categorical Exemption,,,,,,,,,,,,,,
1986113022,California State University Board of Trustees,California State University Board of Trustees,,CLEAN HVAC DUCTS/BALANCE SYSTEM,NOE,11/24/1986,11/24/1986,CLEANING OF ALL DUCTWORK IN LIBRARY/BALANCE SYSTEM,https://ceqanet.opr.ca.gov/1986113022,CLEAN HVAC DUCTS/BALANCE SYSTEM,JON H. REGNIER,,N/A,,400 GOLDEN SHORE,,LONG BEACH,CA,90804,2134984131,,Long Beach,Los Angeles,,,,,,,,,,,,,,,,,Categorical Exemption,,,,,,,,,,,,,,
1986113023,California State University Board of Trustees,California State University Board of Trustees,,REPLACE HOT-WATER STORAGE TANK,NOE,11/24/1986,11/24/1986,"REPLACE OF 2,450 GAL HOT-WATER STORAGE TANK",https://ceqanet.opr.ca.gov/1986113023,REPLACE HOT-WATER STORAGE TANK,JON H. REGNIER,,N/A,,400 GOLDEN SHORE,,LONG BEACH,CA,90804,2134984131,,Long Beach,Los Angeles,,,,,,,,,,,,,,,,,Categorical Exemption,,,,,,,,,,,,,,
1986113024,California State University Board of Trustees,California State University Board of Trustees,,EXTERIOR PAINT/WATER-PROOFING,NOE,11/24/1986,11/24/1986,PAINTING AND WATER-PROOFING OF EXTERIOR,https://ceqanet.opr.ca.gov/1986113024,EXTERIOR PAINT/WATER-PROOFING,JON H. REGNIER,,N/A,,400 GOLDEN SHORE,,LONG BEACH,CA,90804,2134984131,,Long Beach,Los Angeles,,,,,,,,,,,,,,,,,Categorical Exemption,,,,,,,,,,,,,,